{"text_format":"1","workbook":"xlsx","n_sheets":4,"sheets":["Matrix und Hilfstabellen","Arduinoprogramm Übersicht","ArduinoProgramm","ArduinoProgramm MUSTER"],"not_rendered":{"charts":0,"images":0,"macros":1,"external_links":0,"defined_names":0,"comments":0,"pivot_tables":0},"unopened":[],"bounds":{"document_bytes":16777216,"sheet_cells":100000,"rows_first":2000,"rows_last":500,"rows_between":2000,"halvings":0,"cell_chars":16384,"cell_head_chars":4096},"cells_cut":0,"cells_raw":0,"read":"whole","date_system":"1900"}

{"sheet":"Matrix und Hilfstabellen","index":0,"n_rows":122,"n_cols":40,"rows_kept":122,"cut":false,"hidden":false,"merged":[[9,36,9,37]]}
[]
[]
[]
[]
[]
[]
[]
[]
[]
[]
[]
[]
[]
[]
[]
[]
[]
[]
[]
[]
[]
[]
[]
[]
[]
[]
[]
[]
[]
[]
[]
[]
[]
[]
[null,true,true,true,true,true,true,true,true,true,true,true,true,true,true,true,true,true,true,true,true,true,true,true,true,true,true,true,true,true,true,true,true,null,null,null,null,"Farben",null,"Checkfeld"]
[null,true,true,true,true,true,true,true,true,true,true,true,true,true,true,true,true,true,true,true,true,true,true,true,true,true,true,true,true,true,true,true,true,null,null,null,null,"Orange…1",null,2]
[null,true,true,true,true,true,true,true,true,true,true,true,true,true,true,true,true,true,true,true,true,true,true,true,true,true,true,true,true,true,true,true,true,null,null,null,null,"Rot……….2"]
[null,true,true,true,true,true,true,true,true,true,true,true,true,true,true,true,true,true,true,true,true,true,true,true,true,true,true,true,true,true,true,true,true,null,null,null,null,"Grün……3"]
[null,true,true,true,true,true,true,true,true,true,true,true,true,true,true,true,true,true,true,true,true,true,true,true,true,true,true,true,true,true,true,true,true]
[null,true,true,true,true,true,true,true,true,true,true,true,true,true,true,true,true,true,true,true,true,true,true,true,true,true,true,true,true,true,true,true,true]
[null,true,true,true,true,true,true,true,true,true,true,true,true,true,true,true,true,true,true,true,true,true,true,true,true,true,true,true,true,true,true,true,true]
[null,true,true,true,true,true,true,true,true,true,true,true,true,true,true,true,true,true,true,true,true,true,true,true,true,true,true,true,true,true,true,true,true]
[null,true,true,true,true,true,true,true,true,true,true,true,true,true,true,true,true,true,true,true,true,true,true,true,true,true,true,true,true,true,true,true,true]
[null,true,true,true,true,true,true,true,true,true,true,true,true,true,true,true,true,true,true,true,true,true,true,true,true,true,true,true,true,true,true,true,true]
[null,true,true,true,true,true,true,true,true,true,true,true,true,true,true,true,true,true,true,true,true,true,true,true,true,true,true,true,true,true,true,true,true]
[null,true,true,true,true,true,true,true,true,true,true,true,true,true,true,true,true,true,true,true,true,true,true,true,true,true,true,true,true,true,true,true,true]
[null,true,true,true,true,true,true,true,true,true,true,true,true,true,true,true,true,true,true,true,true,true,true,true,true,true,true,true,true,true,true,true,true]
[null,true,true,true,true,true,true,true,true,true,true,true,true,true,true,true,true,true,true,true,true,true,true,true,true,true,true,true,true,true,true,true,true]
[null,true,true,true,true,true,true,true,true,true,true,true,true,true,true,true,true,true,true,true,true,true,true,true,true,true,true,true,true,true,true,true,true]
[null,true,true,true,true,true,true,true,true,true,true,true,true,true,true,true,true,true,true,true,true,true,true,true,true,true,true,true,true,true,true,true,true]
[null,true,true,true,true,true,true,true,true,true,true,true,true,true,true,true,true,true,true,true,true,true,true,true,true,true,true,true,true,true,true,true,true]
[null,true,true,true,true,true,true,true,true,true,true,true,true,true,true,true,true,true,true,true,true,true,true,true,true,true,true,true,true,true,true,true,true]
[null,true,true,true,true,true,true,true,true,true,true,true,true,true,true,true,true,true,true,true,true,true,true,true,true,true,true,true,true,true,true,true,true]
[null,true,true,true,true,true,true,true,true,true,true,true,true,true,true,true,true,true,true,true,true,true,true,true,true,true,true,true,true,true,true,true,true]
[null,true,true,true,true,true,true,true,true,true,true,true,true,true,true,true,true,true,true,true,true,true,true,true,true,true,true,true,true,true,true,true,true]
[null,true,true,true,true,true,true,true,true,true,true,true,true,true,true,true,true,true,true,true,true,true,true,true,true,true,true,true,true,true,true,true,true]
[null,true,true,true,true,true,true,true,true,true,true,true,true,true,true,true,true,true,true,true,true,true,true,true,true,true,true,true,true,true,true,true,true]
[null,true,true,true,true,true,true,true,true,true,true,true,true,true,true,true,true,true,true,true,true,true,true,true,true,true,true,true,true,true,true,true,true]
[]
[]
[null,"0x01","0x02","0x03","0x04","0x05","0x06","0x07","0x08","0x01","0x02","0x03","0x04","0x05","0x06","0x07","0x08","0x01","0x02","0x03","0x04","0x05","0x06","0x07","0x08","0x01","0x02","0x03","0x04","0x05","0x06","0x07","0x08"]
[1,{"$f":"IF(B35=TRUE, 1,0)","v":1},1,{"$f":"IF(D35=TRUE, 1,0)","v":1},{"$f":"IF(E35=TRUE, 1,0)","v":1},{"$f":"IF(F35=TRUE, 1,0)","v":1},1,1,1,1,1,1,1,1,1,1,1,1,1,1,1,1,1,1,1,1,1,1,1,1,1,1,1]
[2,{"$f":"IF(B36=TRUE, 2,0)","v":2},2,{"$f":"IF(D36=TRUE, 2,0)","v":2},{"$f":"IF(E36=TRUE, 2,0)","v":2},{"$f":"IF(F36=TRUE, 2,0)","v":2},2,2,2,2,2,2,2,2,2,2,2,2,2,2,2,2,2,2,2,2,2,2,2,2,2,2,2]
[4,{"$f":"IF(B37=TRUE, 4,0)","v":4},4,{"$f":"IF(D37=TRUE, 4,0)","v":4},{"$f":"IF(E37=TRUE, 4,0)","v":4},{"$f":"IF(F37=TRUE, 4,0)","v":4},4,4,4,4,4,4,4,4,4,4,4,4,4,4,4,4,4,4,4,4,4,4,4,4,4,4,4]
[8,{"$f":"IF(B38=TRUE, 8,0)","v":8},8,{"$f":"IF(D38=TRUE, 8,0)","v":8},{"$f":"IF(E38=TRUE, 8,0)","v":8},{"$f":"IF(F38=TRUE, 8,0)","v":8},8,8,8,8,8,8,8,8,8,8,8,8,8,8,8,8,8,8,8,8,8,8,8,8,8,8,8]
[16,{"$f":"IF(B39=TRUE, 16,0)","v":16},16,{"$f":"IF(D39=TRUE, 16,0)","v":16},{"$f":"IF(E39=TRUE, 16,0)","v":16},{"$f":"IF(F39=TRUE, 16,0)","v":16},16,16,16,16,16,16,16,16,16,16,16,16,16,16,16,16,16,16,16,16,16,16,16,16,16,16,16]
[32,{"$f":"IF(B40=TRUE, 32,0)","v":32},32,{"$f":"IF(D40=TRUE, 32,0)","v":32},{"$f":"IF(E40=TRUE, 32,0)","v":32},{"$f":"IF(F40=TRUE, 32,0)","v":32},32,32,32,32,32,32,32,32,32,32,32,32,32,32,32,32,32,32,32,32,32,32,32,32,32,32,32]
[64,{"$f":"IF(B41=TRUE, 64,0)","v":64},64,{"$f":"IF(D41=TRUE, 64,0)","v":64},{"$f":"IF(E41=TRUE, 64,0)","v":64},{"$f":"IF(F41=TRUE, 64,0)","v":64},64,64,64,64,64,64,64,64,64,64,64,64,64,64,64,64,64,64,64,64,64,64,64,64,64,64,64]
[128,{"$f":"IF(B42=TRUE, 128,0)","v":128},128,{"$f":"IF(D42=TRUE, 128,0)","v":128},{"$f":"IF(E42=TRUE, 128,0)","v":128},{"$f":"IF(F42=TRUE, 128,0)","v":128},128,128,128,128,128,128,128,128,128,128,128,128,128,128,128,128,128,128,128,128,128,128,128,128,128,128,128]
[]
[]
[1,{"$f":"IF(B43=TRUE, 1,0)","v":1},1,{"$f":"IF(D43=TRUE, 1,0)","v":1},{"$f":"IF(E43=TRUE, 1,0)","v":1},1,1,1,1,1,1,1,1,1,1,1,1,1,1,1,1,1,1,1,1,1,1,1,1,1,1,1,1]
[2,{"$f":"IF(B44=TRUE, 2,0)","v":2},2,{"$f":"IF(D44=TRUE, 2,0)","v":2},{"$f":"IF(E44=TRUE, 2,0)","v":2},2,2,2,2,2,2,2,2,2,2,2,2,2,2,2,2,2,2,2,2,2,2,2,2,2,2,2,2]
[4,{"$f":"IF(B45=TRUE, 4,0)","v":4},4,{"$f":"IF(D45=TRUE, 4,0)","v":4},{"$f":"IF(E45=TRUE, 4,0)","v":4},4,4,4,4,4,4,4,4,4,4,4,4,4,4,4,4,4,4,4,4,4,4,4,4,4,4,4,4]
[8,{"$f":"IF(B46=TRUE, 8,0)","v":8},8,{"$f":"IF(D46=TRUE, 8,0)","v":8},{"$f":"IF(E46=TRUE, 8,0)","v":8},8,8,8,8,8,8,8,8,8,8,8,8,8,8,8,8,8,8,8,8,8,8,8,8,8,8,8,8]
[16,{"$f":"IF(B47=TRUE, 16,0)","v":16},16,{"$f":"IF(D47=TRUE, 16,0)","v":16},{"$f":"IF(E47=TRUE, 16,0)","v":16},16,16,16,16,16,16,16,16,16,16,16,16,16,16,16,16,16,16,16,16,16,16,16,16,16,16,16,16]
[32,{"$f":"IF(B48=TRUE, 32,0)","v":32},32,{"$f":"IF(D48=TRUE, 32,0)","v":32},{"$f":"IF(E48=TRUE, 32,0)","v":32},32,32,32,32,32,32,32,32,32,32,32,32,32,32,32,32,32,32,32,32,32,32,32,32,32,32,32,32]
[64,{"$f":"IF(B49=TRUE, 64,0)","v":64},64,{"$f":"IF(D49=TRUE, 64,0)","v":64},{"$f":"IF(E49=TRUE, 64,0)","v":64},64,64,64,64,64,64,64,64,64,64,64,64,64,64,64,64,64,64,64,64,64,64,64,64,64,64,64,64]
[128,{"$f":"IF(B50=TRUE, 128,0)","v":128},128,{"$f":"IF(D50=TRUE, 128,0)","v":128},{"$f":"IF(E50=TRUE, 128,0)","v":128},128,128,128,128,128,128,128,128,128,128,128,128,128,128,128,128,128,128,128,128,128,128,128,128,128,128,128,128]
[]
[]
[1,{"$f":"IF(B51=TRUE, 1,0)","v":1},1,{"$f":"IF(D51=TRUE, 1,0)","v":1},{"$f":"IF(E51=TRUE, 1,0)","v":1},1,1,1,1,1,1,1,1,1,1,1,1,1,1,1,1,1,1,1,1,1,1,1,1,1,1,1,1]
[2,{"$f":"IF(B52=TRUE, 2,0)","v":2},2,{"$f":"IF(D52=TRUE, 2,0)","v":2},{"$f":"IF(E52=TRUE, 2,0)","v":2},2,2,2,2,2,2,2,2,2,2,2,2,2,2,2,2,2,2,2,2,2,2,2,2,2,2,2,2]
[4,{"$f":"IF(B53=TRUE, 4,0)","v":4},4,{"$f":"IF(D53=TRUE, 4,0)","v":4},{"$f":"IF(E53=TRUE, 4,0)","v":4},4,4,4,4,4,4,4,4,4,4,4,4,4,4,4,4,4,4,4,4,4,4,4,4,4,4,4,4]
[8,{"$f":"IF(B54=TRUE, 8,0)","v":8},8,{"$f":"IF(D54=TRUE, 8,0)","v":8},{"$f":"IF(E54=TRUE, 8,0)","v":8},8,8,8,8,8,8,8,8,8,8,8,8,8,8,8,8,8,8,8,8,8,8,8,8,8,8,8,8]
[16,{"$f":"IF(B55=TRUE, 16,0)","v":16},16,{"$f":"IF(D55=TRUE, 16,0)","v":16},{"$f":"IF(E55=TRUE, 16,0)","v":16},16,16,16,16,16,16,16,16,16,16,16,16,16,16,16,16,16,16,16,16,16,16,16,16,16,16,16,16]
[32,{"$f":"IF(B56=TRUE, 32,0)","v":32},32,{"$f":"IF(D56=TRUE, 32,0)","v":32},{"$f":"IF(E56=TRUE, 32,0)","v":32},32,32,32,32,32,32,32,32,32,32,32,32,32,32,32,32,32,32,32,32,32,32,32,32,32,32,32,32]
[64,{"$f":"IF(B57=TRUE, 64,0)","v":64},64,{"$f":"IF(D57=TRUE, 64,0)","v":64},{"$f":"IF(E57=TRUE, 64,0)","v":64},64,64,64,64,64,64,64,64,64,64,64,64,64,64,64,64,64,64,64,64,64,64,64,64,64,64,64,64]
[128,{"$f":"IF(B58=TRUE, 128,0)","v":128},128,{"$f":"IF(D58=TRUE, 128,0)","v":128},{"$f":"IF(E58=TRUE, 128,0)","v":128},128,128,128,128,128,128,128,128,128,128,128,128,128,128,128,128,128,128,128,128,128,128,128,128,128,128,128,128]
[]
[]
[null,"Matrix",null,"Adresse",null,null,"Daten",null,null,"Matrix",null,"Adresse",null,null,"Daten",null,null,"Matrix",null,"Adresse",null,null,"Daten",null,null,"Matrix",null,"Adresse",null,null,"Daten"]
[]
[]
[null,12,null,"0x01",null,null,{"$f":"SUM(B62:B69)","v":255},null,null,9,null,"0x01",null,null,{"$f":"SUM(J62:J69)","v":255},null,null,6,null,"0x01",null,null,{"$f":"SUM(R62:R69)","v":255},null,null,3,null,"0x01",null,null,{"$f":"SUM(Z62:Z69)","v":255}]
[null,null,null,"0x02",null,null,{"$f":"SUM(C62:C69)","v":255},null,null,null,null,"0x02",null,null,{"$f":"SUM(K62:K69)","v":255},null,null,null,null,"0x02",null,null,{"$f":"SUM(S62:S69)","v":255},null,null,null,null,"0x02",null,null,{"$f":"SUM(AA62:AA69)","v":255}]
[null,null,null,"0x03",null,null,{"$f":"SUM(D62:D69)","v":255},null,null,null,null,"0x03",null,null,{"$f":"SUM(L62:L69)","v":255},null,null,null,null,"0x03",null,null,{"$f":"SUM(T62:T69)","v":255},null,null,null,null,"0x03",null,null,{"$f":"SUM(AB62:AB69)","v":255}]
[null,null,null,"0x04",null,null,{"$f":"SUM(E62:E69)","v":255},null,null,null,null,"0x04",null,null,{"$f":"SUM(M62:M69)","v":255},null,null,null,null,"0x04",null,null,{"$f":"SUM(U62:U69)","v":255},null,null,null,null,"0x04",null,null,{"$f":"SUM(AC62:AC69)","v":255}]
[null,null,null,"0x05",null,null,{"$f":"SUM(F62:F69)","v":255},null,null,null,null,"0x05",null,null,{"$f":"SUM(N62:N69)","v":255},null,null,null,null,"0x05",null,null,{"$f":"SUM(V62:V69)","v":255},null,null,null,null,"0x05",null,null,{"$f":"SUM(AD62:AD69)","v":255}]
[null,null,null,"0x06",null,null,{"$f":"SUM(G62:G69)","v":255},null,null,null,null,"0x06",null,null,{"$f":"SUM(O62:O69)","v":255},null,null,null,null,"0x06",null,null,{"$f":"SUM(W62:W69)","v":255},null,null,null,null,"0x06",null,null,{"$f":"SUM(AE62:AE69)","v":255}]
[null,null,null,"0x07",null,null,{"$f":"SUM(H62:H69)","v":255},null,null,null,null,"0x07",null,null,{"$f":"SUM(P62:P69)","v":255},null,null,null,null,"0x07",null,null,{"$f":"SUM(X62:X69)","v":255},null,null,null,null,"0x07",null,null,{"$f":"SUM(AF62:AF69)","v":255}]
[null,null,null,"0x08",null,null,{"$f":"SUM(I62:I69)","v":255},null,null,null,null,"0x08",null,null,{"$f":"SUM(Q62:Q69)","v":255},null,null,null,null,"0x08",null,null,{"$f":"SUM(Y62:Y69)","v":255},null,null,null,null,"0x08",null,null,{"$f":"SUM(AG62:AG69)","v":255}]
[]
[]
[null,11,null,"0x01",null,null,{"$f":"SUM(B72:B79)","v":255},null,null,8,null,"0x01",null,null,{"$f":"SUM(J72:J79)","v":255},null,null,5,null,"0x01",null,null,{"$f":"SUM(R72:R79)","v":255},null,null,2,null,"0x01",null,null,{"$f":"SUM(Z72:Z79)","v":255}]
[null,null,null,"0x02",null,null,{"$f":"SUM(C72:C79)","v":255},null,null,null,null,"0x02",null,null,{"$f":"SUM(K72:K79)","v":255},null,null,null,null,"0x02",null,null,{"$f":"SUM(S72:S79)","v":255},null,null,null,null,"0x02",null,null,{"$f":"SUM(AA72:AA79)","v":255}]
[null,null,null,"0x03",null,null,{"$f":"SUM(D72:D79)","v":255},null,null,null,null,"0x03",null,null,{"$f":"SUM(L72:L79)","v":255},null,null,null,null,"0x03",null,null,{"$f":"SUM(T72:T79)","v":255},null,null,null,null,"0x03",null,null,{"$f":"SUM(AB72:AB79)","v":255}]
[null,null,null,"0x04",null,null,{"$f":"SUM(E72:E79)","v":255},null,null,null,null,"0x04",null,null,{"$f":"SUM(M72:M79)","v":255},null,null,null,null,"0x04",null,null,{"$f":"SUM(U72:U79)","v":255},null,null,null,null,"0x04",null,null,{"$f":"SUM(AC72:AC79)","v":255}]
[null,null,null,"0x05",null,null,{"$f":"SUM(F72:F79)","v":255},null,null,null,null,"0x05",null,null,{"$f":"SUM(N72:N79)","v":255},null,null,null,null,"0x05",null,null,{"$f":"SUM(V72:V79)","v":255},null,null,null,null,"0x05",null,null,{"$f":"SUM(AD72:AD79)","v":255}]
[null,null,null,"0x06",null,null,{"$f":"SUM(G72:G79)","v":255},null,null,null,null,"0x06",null,null,{"$f":"SUM(O72:O79)","v":255},null,null,null,null,"0x06",null,null,{"$f":"SUM(W72:W79)","v":255},null,null,null,null,"0x06",null,null,{"$f":"SUM(AE72:AE79)","v":255}]
[null,null,null,"0x07",null,null,{"$f":"SUM(H72:H79)","v":255},null,null,null,null,"0x07",null,null,{"$f":"SUM(P72:P79)","v":255},null,null,null,null,"0x07",null,null,{"$f":"SUM(X72:X79)","v":255},null,null,null,null,"0x07",null,null,{"$f":"SUM(AF72:AF79)","v":255}]
[null,null,null,"0x08",null,null,{"$f":"SUM(I72:I79)","v":255},null,null,null,null,"0x08",null,null,{"$f":"SUM(Q72:Q79)","v":255},null,null,null,null,"0x08",null,null,{"$f":"SUM(Y72:Y79)","v":255},null,null,null,null,"0x08",null,null,{"$f":"SUM(AG72:AG79)","v":255}]
[]
[]
[null,10,null,"0x01",null,null,{"$f":"SUM(B82:B89)","v":255},null,null,7,null,"0x01",null,null,{"$f":"SUM(J82:J89)","v":255},null,null,4,null,"0x01",null,null,{"$f":"SUM(R82:R89)","v":255},null,null,1,null,"0x01",null,null,{"$f":"SUM(Z82:Z89)","v":255}]
[null,null,null,"0x02",null,null,{"$f":"SUM(C82:C89)","v":255},null,null,null,null,"0x02",null,null,{"$f":"SUM(K82:K89)","v":255},null,null,null,null,"0x02",null,null,{"$f":"SUM(S82:S89)","v":255},null,null,null,null,"0x02",null,null,{"$f":"SUM(AA82:AA89)","v":255}]
[null,null,null,"0x03",null,null,{"$f":"SUM(D82:D89)","v":255},null,null,null,null,"0x03",null,null,{"$f":"SUM(L82:L89)","v":255},null,null,null,null,"0x03",null,null,{"$f":"SUM(T82:T89)","v":255},null,null,null,null,"0x03",null,null,{"$f":"SUM(AB82:AB89)","v":255}]
[null,null,null,"0x04",null,null,{"$f":"SUM(E82:E89)","v":255},null,null,null,null,"0x04",null,null,{"$f":"SUM(M82:M89)","v":255},null,null,null,null,"0x04",null,null,{"$f":"SUM(U82:U89)","v":255},null,null,null,null,"0x04",null,null,{"$f":"SUM(AC82:AC89)","v":255}]
[null,null,null,"0x05",null,null,{"$f":"SUM(F82:F89)","v":255},null,null,null,null,"0x05",null,null,{"$f":"SUM(N82:N89)","v":255},null,null,null,null,"0x05",null,null,{"$f":"SUM(V82:V89)","v":255},null,null,null,null,"0x05",null,null,{"$f":"SUM(AD82:AD89)","v":255}]
[null,null,null,"0x06",null,null,{"$f":"SUM(G82:G89)","v":255},null,null,null,null,"0x06",null,null,{"$f":"SUM(O82:O89)","v":255},null,null,null,null,"0x06",null,null,{"$f":"SUM(W82:W89)","v":255},null,null,null,null,"0x06",null,null,{"$f":"SUM(AE82:AE89)","v":255}]
[null,null,null,"0x07",null,null,{"$f":"SUM(H82:H89)","v":255},null,null,null,null,"0x07",null,null,{"$f":"SUM(P82:P89)","v":255},null,null,null,null,"0x07",null,null,{"$f":"SUM(X82:X89)","v":255},null,null,null,null,"0x07",null,null,{"$f":"SUM(AF82:AF89)","v":255}]
[null,null,null,"0x08",null,null,{"$f":"SUM(I82:I89)","v":255},null,null,null,null,"0x08",null,null,{"$f":"SUM(Q82:Q89)","v":255},null,null,null,null,"0x08",null,null,{"$f":"SUM(Y82:Y89)","v":255},null,null,null,null,"0x08",null,null,{"$f":"SUM(AG82:AG89)","v":255}]

{"sheet":"Arduinoprogramm Übersicht","index":1,"n_rows":122,"n_cols":32,"rows_kept":122,"cut":false,"hidden":false,"merged":[]}
[null,"Adresse:","0x01",null,null,"Adresse:","0x02",null,null,"Adresse:","0x03",null,null,"Adresse:","0x04",null,null,"Adresse:","0x05",null,null,"Adresse:","0x06",null,null,"Adresse:","0x07",null,null,"Adresse:","0x08"]
[]
[]
[null,{"$f":"IF('Matrix und Hilfstabellen'!$AN$36=1,\"digitalWrite(\",\"\")","v":""},{"$f":"IF('Matrix und Hilfstabellen'!$AN$36=1,\"rt\",\"\")","v":""},{"$f":"IF('Matrix und Hilfstabellen'!$AN$36=1,\",LOW);\",\"\")","v":""},null,{"$f":"IF('Matrix und Hilfstabellen'!$AN$36=1,\"digitalWrite(\",\"\")","v":""},{"$f":"IF('Matrix und Hilfstabellen'!$AN$36=1,\"rt\",\"\")","v":""},{"$f":"IF('Matrix und Hilfstabellen'!$AN$36=1,\",LOW);\",\"\")","v":""},null,{"$f":"IF('Matrix und Hilfstabellen'!$AN$36=1,\"digitalWrite(\",\"\")","v":""},{"$f":"IF('Matrix und Hilfstabellen'!$AN$36=1,\"rt\",\"\")","v":""},{"$f":"IF('Matrix und Hilfstabellen'!$AN$36=1,\",LOW);\",\"\")","v":""},null,{"$f":"IF('Matrix und Hilfstabellen'!$AN$36=1,\"digitalWrite(\",\"\")","v":""},{"$f":"IF('Matrix und Hilfstabellen'!$AN$36=1,\"rt\",\"\")","v":""},{"$f":"IF('Matrix und Hilfstabellen'!$AN$36=1,\",LOW);\",\"\")","v":""},null,{"$f":"IF('Matrix und Hilfstabellen'!$AN$36=1,\"digitalWrite(\",\"\")","v":""},{"$f":"IF('Matrix und Hilfstabellen'!$AN$36=1,\"rt\",\"\")","v":""},{"$f":"IF('Matrix und Hilfstabellen'!$AN$36=1,\",LOW);\",\"\")","v":""},null,{"$f":"IF('Matrix und Hilfstabellen'!$AN$36=1,\"digitalWrite(\",\"\")","v":""},{"$f":"IF('Matrix und Hilfstabellen'!$AN$36=1,\"rt\",\"\")","v":""},{"$f":"IF('Matrix und Hilfstabellen'!$AN$36=1,\",LOW);\",\"\")","v":""},null,{"$f":"IF('Matrix und Hilfstabellen'!$AN$36=1,\"digitalWrite(\",\"\")","v":""},{"$f":"IF('Matrix und Hilfstabellen'!$AN$36=1,\"rt\",\"\")","v":""},{"$f":"IF('Matrix und Hilfstabellen'!$AN$36=1,\",LOW);\",\"\")","v":""},null,{"$f":"IF('Matrix und Hilfstabellen'!$AN$36=1,\"digitalWrite(\",\"\")","v":""},{"$f":"IF('Matrix und Hilfstabellen'!$AN$36=1,\"rt\",\"\")","v":""},{"$f":"IF('Matrix und Hilfstabellen'!$AN$36=1,\",LOW);\",\"\")","v":""}]
[null,"digitalWrite(",{"$f":"IF('Matrix und Hilfstabellen'!$AN$36=2,\"rt\",\"gn\")","v":"rt"},",LOW);",null,"digitalWrite(",{"$f":"IF('Matrix und Hilfstabellen'!$AN$36=2,\"rt\",\"gn\")","v":"rt"},",LOW);",null,"digitalWrite(",{"$f":"IF('Matrix und Hilfstabellen'!$AN$36=2,\"rt\",\"gn\")","v":"rt"},",LOW);",null,"digitalWrite(",{"$f":"IF('Matrix und Hilfstabellen'!$AN$36=2,\"rt\",\"gn\")","v":"rt"},",LOW);",null,"digitalWrite(",{"$f":"IF('Matrix und Hilfstabellen'!$AN$36=2,\"rt\",\"gn\")","v":"rt"},",LOW);",null,"digitalWrite(",{"$f":"IF('Matrix und Hilfstabellen'!$AN$36=2,\"rt\",\"gn\")","v":"rt"},",LOW);",null,"digitalWrite(",{"$f":"IF('Matrix und Hilfstabellen'!$AN$36=2,\"rt\",\"gn\")","v":"rt"},",LOW);",null,"digitalWrite(",{"$f":"IF('Matrix und Hilfstabellen'!$AN$36=2,\"rt\",\"gn\")","v":"rt"},",LOW);"]
[]
[null,"SPI.transfer(",{"$f":"C$1","v":"0x01"},");",null,"SPI.transfer(",{"$f":"G$1","v":"0x02"},");",null,"SPI.transfer(",{"$f":"K$1","v":"0x03"},");",null,"SPI.transfer(",{"$f":"O$1","v":"0x04"},");",null,"SPI.transfer(",{"$f":"S$1","v":"0x05"},");",null,"SPI.transfer(",{"$f":"W$1","v":"0x06"},");",null,"SPI.transfer(",{"$f":"AA$1","v":"0x07"},");",null,"SPI.transfer(",{"$f":"AE$1","v":"0x08"},");"]
[null,"SPI.transfer(",{"$f":"'Matrix und Hilfstabellen'!G95","v":255},");",null,"SPI.transfer(",{"$f":"'Matrix und Hilfstabellen'!G96","v":255},");",null,"SPI.transfer(",{"$f":"'Matrix und Hilfstabellen'!G97","v":255},");",null,"SPI.transfer(",{"$f":"'Matrix und Hilfstabellen'!G98","v":255},");",null,"SPI.transfer(",{"$f":"'Matrix und Hilfstabellen'!G99","v":255},");",null,"SPI.transfer(",{"$f":"'Matrix und Hilfstabellen'!G100","v":255},");",null,"SPI.transfer(",{"$f":"'Matrix und Hilfstabellen'!G101","v":255},");",null,"SPI.transfer(",{"$f":"'Matrix und Hilfstabellen'!G102","v":255},");"]
[]
[]
[]
[]
[]
[]
[]
[]
[null,"SPI.transfer(",{"$f":"C$1","v":"0x01"},");",null,"SPI.transfer(",{"$f":"G$1","v":"0x02"},");",null,"SPI.transfer(",{"$f":"K$1","v":"0x03"},");",null,"SPI.transfer(",{"$f":"O$1","v":"0x04"},");",null,"SPI.transfer(",{"$f":"S$1","v":"0x05"},");",null,"SPI.transfer(",{"$f":"W$1","v":"0x06"},");",null,"SPI.transfer(",{"$f":"AA$1","v":"0x07"},");",null,"SPI.transfer(",{"$f":"AE$1","v":"0x08"},");"]
[null,"SPI.transfer(",{"$f":"'Matrix und Hilfstabellen'!G105","v":255},");",null,"SPI.transfer(",{"$f":"'Matrix und Hilfstabellen'!G106","v":255},");",null,"SPI.transfer(",{"$f":"'Matrix und Hilfstabellen'!G107","v":255},");",null,"SPI.transfer(",{"$f":"'Matrix und Hilfstabellen'!G108","v":255},");",null,"SPI.transfer(",{"$f":"'Matrix und Hilfstabellen'!G109","v":255},");",null,"SPI.transfer(",{"$f":"'Matrix und Hilfstabellen'!G110","v":255},");",null,"SPI.transfer(",{"$f":"'Matrix und Hilfstabellen'!G111","v":255},");",null,"SPI.transfer(",{"$f":"'Matrix und Hilfstabellen'!G112","v":255},");"]
[]
[]
[]
[]
[]
[]
[]
[]
[null,"SPI.transfer(",{"$f":"C$1","v":"0x01"},");",null,"SPI.transfer(",{"$f":"G$1","v":"0x02"},");",null,"SPI.transfer(",{"$f":"K$1","v":"0x03"},");",null,"SPI.transfer(",{"$f":"O$1","v":"0x04"},");",null,"SPI.transfer(",{"$f":"S$1","v":"0x05"},");",null,"SPI.transfer(",{"$f":"W$1","v":"0x06"},");",null,"SPI.transfer(",{"$f":"AA$1","v":"0x07"},");",null,"SPI.transfer(",{"$f":"AE$1","v":"0x08"},");"]
[null,"SPI.transfer(",{"$f":"'Matrix und Hilfstabellen'!G115","v":255},");",null,"SPI.transfer(",{"$f":"'Matrix und Hilfstabellen'!G116","v":255},");",null,"SPI.transfer(",{"$f":"'Matrix und Hilfstabellen'!G117","v":255},");",null,"SPI.transfer(",{"$f":"'Matrix und Hilfstabellen'!G118","v":255},");",null,"SPI.transfer(",{"$f":"'Matrix und Hilfstabellen'!G119","v":255},");",null,"SPI.transfer(",{"$f":"'Matrix und Hilfstabellen'!G120","v":255},");",null,"SPI.transfer(",{"$f":"'Matrix und Hilfstabellen'!G121","v":255},");",null,"SPI.transfer(",{"$f":"'Matrix und Hilfstabellen'!G122","v":255},");"]
[]
[]
[]
[]
[]
[]
[]
[]
[null,"SPI.transfer(",{"$f":"C$1","v":"0x01"},");",null,"SPI.transfer(",{"$f":"G$1","v":"0x02"},");",null,"SPI.transfer(",{"$f":"K$1","v":"0x03"},");",null,"SPI.transfer(",{"$f":"O$1","v":"0x04"},");",null,"SPI.transfer(",{"$f":"S$1","v":"0x05"},");",null,"SPI.transfer(",{"$f":"W$1","v":"0x06"},");",null,"SPI.transfer(",{"$f":"AA$1","v":"0x07"},");",null,"SPI.transfer(",{"$f":"AE$1","v":"0x08"},");"]
[null,"SPI.transfer(",{"$f":"'Matrix und Hilfstabellen'!O95","v":255},");",null,"SPI.transfer(",{"$f":"'Matrix und Hilfstabellen'!O96","v":255},");",null,"SPI.transfer(",{"$f":"'Matrix und Hilfstabellen'!O97","v":255},");",null,"SPI.transfer(",{"$f":"'Matrix und Hilfstabellen'!O98","v":255},");",null,"SPI.transfer(",{"$f":"'Matrix und Hilfstabellen'!O99","v":255},");",null,"SPI.transfer(",{"$f":"'Matrix und Hilfstabellen'!O100","v":255},");",null,"SPI.transfer(",{"$f":"'Matrix und Hilfstabellen'!O101","v":255},");",null,"SPI.transfer(",{"$f":"'Matrix und Hilfstabellen'!O102","v":255},");"]
[]
[]
[]
[]
[]
[]
[]
[]
[null,"SPI.transfer(",{"$f":"C$1","v":"0x01"},");",null,"SPI.transfer(",{"$f":"G$1","v":"0x02"},");",null,"SPI.transfer(",{"$f":"K$1","v":"0x03"},");",null,"SPI.transfer(",{"$f":"O$1","v":"0x04"},");",null,"SPI.transfer(",{"$f":"S$1","v":"0x05"},");",null,"SPI.transfer(",{"$f":"W$1","v":"0x06"},");",null,"SPI.transfer(",{"$f":"AA$1","v":"0x07"},");",null,"SPI.transfer(",{"$f":"AE$1","v":"0x08"},");"]
[null,"SPI.transfer(",{"$f":"'Matrix und Hilfstabellen'!O105","v":255},");",null,"SPI.transfer(",{"$f":"'Matrix und Hilfstabellen'!O106","v":255},");",null,"SPI.transfer(",{"$f":"'Matrix und Hilfstabellen'!O107","v":255},");",null,"SPI.transfer(",{"$f":"'Matrix und Hilfstabellen'!O108","v":255},");",null,"SPI.transfer(",{"$f":"'Matrix und Hilfstabellen'!O109","v":255},");",null,"SPI.transfer(",{"$f":"'Matrix und Hilfstabellen'!O110","v":255},");",null,"SPI.transfer(",{"$f":"'Matrix und Hilfstabellen'!O111","v":255},");",null,"SPI.transfer(",{"$f":"'Matrix und Hilfstabellen'!O112","v":255},");"]
[]
[]
[]
[]
[]
[]
[]
[]
[null,"SPI.transfer(",{"$f":"C$1","v":"0x01"},");",null,"SPI.transfer(",{"$f":"G$1","v":"0x02"},");",null,"SPI.transfer(",{"$f":"K$1","v":"0x03"},");",null,"SPI.transfer(",{"$f":"O$1","v":"0x04"},");",null,"SPI.transfer(",{"$f":"S$1","v":"0x05"},");",null,"SPI.transfer(",{"$f":"W$1","v":"0x06"},");",null,"SPI.transfer(",{"$f":"AA$1","v":"0x07"},");",null,"SPI.transfer(",{"$f":"AE$1","v":"0x08"},");"]
[null,"SPI.transfer(",{"$f":"'Matrix und Hilfstabellen'!O115","v":255},");",null,"SPI.transfer(",{"$f":"'Matrix und Hilfstabellen'!O116","v":255},");",null,"SPI.transfer(",{"$f":"'Matrix und Hilfstabellen'!O117","v":255},");",null,"SPI.transfer(",{"$f":"'Matrix und Hilfstabellen'!O118","v":255},");",null,"SPI.transfer(",{"$f":"'Matrix und Hilfstabellen'!O119","v":255},");",null,"SPI.transfer(",{"$f":"'Matrix und Hilfstabellen'!O120","v":255},");",null,"SPI.transfer(",{"$f":"'Matrix und Hilfstabellen'!O121","v":255},");",null,"SPI.transfer(",{"$f":"'Matrix und Hilfstabellen'!O122","v":255},");"]
[]
[]
[]
[]
[]
[]
[]
[]
[null,"SPI.transfer(",{"$f":"C$1","v":"0x01"},");",null,"SPI.transfer(",{"$f":"G$1","v":"0x02"},");",null,"SPI.transfer(",{"$f":"K$1","v":"0x03"},");",null,"SPI.transfer(",{"$f":"O$1","v":"0x04"},");",null,"SPI.transfer(",{"$f":"S$1","v":"0x05"},");",null,"SPI.transfer(",{"$f":"W$1","v":"0x06"},");",null,"SPI.transfer(",{"$f":"AA$1","v":"0x07"},");",null,"SPI.transfer(",{"$f":"AE$1","v":"0x08"},");"]
[null,"SPI.transfer(",{"$f":"'Matrix und Hilfstabellen'!W95","v":255},");",null,"SPI.transfer(",{"$f":"'Matrix und Hilfstabellen'!W96","v":255},");",null,"SPI.transfer(",{"$f":"'Matrix und Hilfstabellen'!W97","v":255},");",null,"SPI.transfer(",{"$f":"'Matrix und Hilfstabellen'!W98","v":255},");",null,"SPI.transfer(",{"$f":"'Matrix und Hilfstabellen'!W99","v":255},");",null,"SPI.transfer(",{"$f":"'Matrix und Hilfstabellen'!W100","v":255},");",null,"SPI.transfer(",{"$f":"'Matrix und Hilfstabellen'!W101","v":255},");",null,"SPI.transfer(",{"$f":"'Matrix und Hilfstabellen'!W102","v":255},");"]
[]
[]
[]
[]
[]
[]
[]
[]
[null,"SPI.transfer(",{"$f":"C$1","v":"0x01"},");",null,"SPI.transfer(",{"$f":"G$1","v":"0x02"},");",null,"SPI.transfer(",{"$f":"K$1","v":"0x03"},");",null,"SPI.transfer(",{"$f":"O$1","v":"0x04"},");",null,"SPI.transfer(",{"$f":"S$1","v":"0x05"},");",null,"SPI.transfer(",{"$f":"W$1","v":"0x06"},");",null,"SPI.transfer(",{"$f":"AA$1","v":"0x07"},");",null,"SPI.transfer(",{"$f":"AE$1","v":"0x08"},");"]
[null,"SPI.transfer(",{"$f":"'Matrix und Hilfstabellen'!W105","v":255},");",null,"SPI.transfer(",{"$f":"'Matrix und Hilfstabellen'!W106","v":255},");",null,"SPI.transfer(",{"$f":"'Matrix und Hilfstabellen'!W107","v":255},");",null,"SPI.transfer(",{"$f":"'Matrix und Hilfstabellen'!W108","v":255},");",null,"SPI.transfer(",{"$f":"'Matrix und Hilfstabellen'!W109","v":255},");",null,"SPI.transfer(",{"$f":"'Matrix und Hilfstabellen'!W110","v":255},");",null,"SPI.transfer(",{"$f":"'Matrix und Hilfstabellen'!W111","v":255},");",null,"SPI.transfer(",{"$f":"'Matrix und Hilfstabellen'!W112","v":255},");"]
[]
[]
[]
[]
[]
[]
[]
[]
[null,"SPI.transfer(",{"$f":"C$1","v":"0x01"},");",null,"SPI.transfer(",{"$f":"G$1","v":"0x02"},");",null,"SPI.transfer(",{"$f":"K$1","v":"0x03"},");",null,"SPI.transfer(",{"$f":"O$1","v":"0x04"},");",null,"SPI.transfer(",{"$f":"S$1","v":"0x05"},");",null,"SPI.transfer(",{"$f":"W$1","v":"0x06"},");",null,"SPI.transfer(",{"$f":"AA$1","v":"0x07"},");",null,"SPI.transfer(",{"$f":"AE$1","v":"0x08"},");"]
[null,"SPI.transfer(",{"$f":"'Matrix und Hilfstabellen'!W115","v":255},");",null,"SPI.transfer(",{"$f":"'Matrix und Hilfstabellen'!W116","v":255},");",null,"SPI.transfer(",{"$f":"'Matrix und Hilfstabellen'!W117","v":255},");",null,"SPI.transfer(",{"$f":"'Matrix und Hilfstabellen'!W118","v":255},");",null,"SPI.transfer(",{"$f":"'Matrix und Hilfstabellen'!W119","v":255},");",null,"SPI.transfer(",{"$f":"'Matrix und Hilfstabellen'!W120","v":255},");",null,"SPI.transfer(",{"$f":"'Matrix und Hilfstabellen'!W121","v":255},");",null,"SPI.transfer(",{"$f":"'Matrix und Hilfstabellen'!W122","v":255},");"]
[]
[]
[]
[]
[]
[]
[]
[]
[null,"SPI.transfer(",{"$f":"C$1","v":"0x01"},");",null,"SPI.transfer(",{"$f":"G$1","v":"0x02"},");",null,"SPI.transfer(",{"$f":"K$1","v":"0x03"},");",null,"SPI.transfer(",{"$f":"O$1","v":"0x04"},");",null,"SPI.transfer(",{"$f":"S$1","v":"0x05"},");",null,"SPI.transfer(",{"$f":"W$1","v":"0x06"},");",null,"SPI.transfer(",{"$f":"AA$1","v":"0x07"},");",null,"SPI.transfer(",{"$f":"AE$1","v":"0x08"},");"]
[null,"SPI.transfer(",{"$f":"'Matrix und Hilfstabellen'!AE95","v":255},");",null,"SPI.transfer(",{"$f":"'Matrix und Hilfstabellen'!AE96","v":255},");",null,"SPI.transfer(",{"$f":"'Matrix und Hilfstabellen'!AE97","v":255},");",null,"SPI.transfer(",{"$f":"'Matrix und Hilfstabellen'!AE98","v":255},");",null,"SPI.transfer(",{"$f":"'Matrix und Hilfstabellen'!AE99","v":255},");",null,"SPI.transfer(",{"$f":"'Matrix und Hilfstabellen'!AE100","v":255},");",null,"SPI.transfer(",{"$f":"'Matrix und Hilfstabellen'!AE101","v":255},");",null,"SPI.transfer(",{"$f":"'Matrix und Hilfstabellen'!AE102","v":255},");"]
[]
[]
[]
[]
[]
[]
[]
[]
[null,"SPI.transfer(",{"$f":"C$1","v":"0x01"},");",null,"SPI.transfer(",{"$f":"G$1","v":"0x02"},");",null,"SPI.transfer(",{"$f":"K$1","v":"0x03"},");",null,"SPI.transfer(",{"$f":"O$1","v":"0x04"},");",null,"SPI.transfer(",{"$f":"S$1","v":"0x05"},");",null,"SPI.transfer(",{"$f":"W$1","v":"0x06"},");",null,"SPI.transfer(",{"$f":"AA$1","v":"0x07"},");",null,"SPI.transfer(",{"$f":"AE$1","v":"0x08"},");"]
[null,"SPI.transfer(",{"$f":"'Matrix und Hilfstabellen'!AE105","v":255},");",null,"SPI.transfer(",{"$f":"'Matrix und Hilfstabellen'!AE106","v":255},");",null,"SPI.transfer(",{"$f":"'Matrix und Hilfstabellen'!AE107","v":255},");",null,"SPI.transfer(",{"$f":"'Matrix und Hilfstabellen'!AE108","v":255},");",null,"SPI.transfer(",{"$f":"'Matrix und Hilfstabellen'!AE109","v":255},");",null,"SPI.transfer(",{"$f":"'Matrix und Hilfstabellen'!AE110","v":255},");",null,"SPI.transfer(",{"$f":"'Matrix und Hilfstabellen'!AE111","v":255},");",null,"SPI.transfer(",{"$f":"'Matrix und Hilfstabellen'!AE112","v":255},");"]
[]
[]
[]
[]
[]
[]
[]
[]
[null,"SPI.transfer(",{"$f":"C$1","v":"0x01"},");",null,"SPI.transfer(",{"$f":"G$1","v":"0x02"},");",null,"SPI.transfer(",{"$f":"K$1","v":"0x03"},");",null,"SPI.transfer(",{"$f":"O$1","v":"0x04"},");",null,"SPI.transfer(",{"$f":"S$1","v":"0x05"},");",null,"SPI.transfer(",{"$f":"W$1","v":"0x06"},");",null,"SPI.transfer(",{"$f":"AA$1","v":"0x07"},");",null,"SPI.transfer(",{"$f":"AE$1","v":"0x08"},");"]
[null,"SPI.transfer(",{"$f":"'Matrix und Hilfstabellen'!AE115","v":255},");",null,"SPI.transfer(",{"$f":"'Matrix und Hilfstabellen'!AE116","v":255},");",null,"SPI.transfer(",{"$f":"'Matrix und Hilfstabellen'!AE117","v":255},");",null,"SPI.transfer(",{"$f":"'Matrix und Hilfstabellen'!AE118","v":255},");",null,"SPI.transfer(",{"$f":"'Matrix und Hilfstabellen'!AE119","v":255},");",null,"SPI.transfer(",{"$f":"'Matrix und Hilfstabellen'!AE120","v":255},");",null,"SPI.transfer(",{"$f":"'Matrix und Hilfstabellen'!AE121","v":255},");",null,"SPI.transfer(",{"$f":"'Matrix und Hilfstabellen'!AE122","v":255},");"]
[]
[]
[null,"digitalWrite(",{"$f":"IF('Matrix und Hilfstabellen'!$AN$36=2,\"rt\",\"gn\")","v":"rt"},",HIGH);",null,"digitalWrite(",{"$f":"IF('Matrix und Hilfstabellen'!$AN$36=2,\"rt\",\"gn\")","v":"rt"},",HIGH);",null,"digitalWrite(",{"$f":"IF('Matrix und Hilfstabellen'!$AN$36=2,\"rt\",\"gn\")","v":"rt"},",HIGH);",null,"digitalWrite(",{"$f":"IF('Matrix und Hilfstabellen'!$AN$36=2,\"rt\",\"gn\")","v":"rt"},",HIGH);",null,"digitalWrite(",{"$f":"IF('Matrix und Hilfstabellen'!$AN$36=2,\"rt\",\"gn\")","v":"rt"},",HIGH);",null,"digitalWrite(",{"$f":"IF('Matrix und Hilfstabellen'!$AN$36=2,\"rt\",\"gn\")","v":"rt"},",HIGH);",null,"digitalWrite(",{"$f":"IF('Matrix und Hilfstabellen'!$AN$36=2,\"rt\",\"gn\")","v":"rt"},",HIGH);",null,"digitalWrite(",{"$f":"IF('Matrix und Hilfstabellen'!$AN$36=2,\"rt\",\"gn\")","v":"rt"},",HIGH);"]
[null,{"$f":"IF('Matrix und Hilfstabellen'!$AN$36=1,\"digitalWrite(\",\"\")","v":""},{"$f":"IF('Matrix und Hilfstabellen'!$AN$36=1,\"rt\",\"\")","v":""},{"$f":"IF('Matrix und Hilfstabellen'!$AN$36=1,\",HIGH);\",\"\")","v":""},null,{"$f":"IF('Matrix und Hilfstabellen'!$AN$36=1,\"digitalWrite(\",\"\")","v":""},{"$f":"IF('Matrix und Hilfstabellen'!$AN$36=1,\"rt\",\"\")","v":""},{"$f":"IF('Matrix und Hilfstabellen'!$AN$36=1,\",HIGH);\",\"\")","v":""},null,{"$f":"IF('Matrix und Hilfstabellen'!$AN$36=1,\"digitalWrite(\",\"\")","v":""},{"$f":"IF('Matrix und Hilfstabellen'!$AN$36=1,\"rt\",\"\")","v":""},{"$f":"IF('Matrix und Hilfstabellen'!$AN$36=1,\",HIGH);\",\"\")","v":""},null,{"$f":"IF('Matrix und Hilfstabellen'!$AN$36=1,\"digitalWrite(\",\"\")","v":""},{"$f":"IF('Matrix und Hilfstabellen'!$AN$36=1,\"rt\",\"\")","v":""},{"$f":"IF('Matrix und Hilfstabellen'!$AN$36=1,\",HIGH);\",\"\")","v":""},null,{"$f":"IF('Matrix und Hilfstabellen'!$AN$36=1,\"digitalWrite(\",\"\")","v":""},{"$f":"IF('Matrix und Hilfstabellen'!$AN$36=1,\"rt\",\"\")","v":""},{"$f":"IF('Matrix und Hilfstabellen'!$AN$36=1,\",HIGH);\",\"\")","v":""},null,{"$f":"IF('Matrix und Hilfstabellen'!$AN$36=1,\"digitalWrite(\",\"\")","v":""},{"$f":"IF('Matrix und Hilfstabellen'!$AN$36=1,\"rt\",\"\")","v":""},{"$f":"IF('Matrix und Hilfstabellen'!$AN$36=1,\",HIGH);\",\"\")","v":""},null,{"$f":"IF('Matrix und Hilfstabellen'!$AN$36=1,\"digitalWrite(\",\"\")","v":""},{"$f":"IF('Matrix und Hilfstabellen'!$AN$36=1,\"rt\",\"\")","v":""},{"$f":"IF('Matrix und Hilfstabellen'!$AN$36=1,\",HIGH);\",\"\")","v":""},null,{"$f":"IF('Matrix und Hilfstabellen'!$AN$36=1,\"digitalWrite(\",\"\")","v":""},{"$f":"IF('Matrix und Hilfstabellen'!$AN$36=1,\"rt\",\"\")","v":""},{"$f":"IF('Matrix und Hilfstabellen'!$AN$36=1,\",HIGH);\",\"\")","v":""}]

{"sheet":"ArduinoProgramm","index":2,"n_rows":224,"n_cols":3,"rows_kept":224,"cut":false,"hidden":false,"merged":[]}
["","",""]
["digitalWrite(","rt",",LOW);"]
["SPI.transfer(","0x01",");"]
["SPI.transfer(",255,");"]
["SPI.transfer(","0x01",");"]
["SPI.transfer(",255,");"]
["SPI.transfer(","0x01",");"]
["SPI.transfer(",255,");"]
["SPI.transfer(","0x01",");"]
["SPI.transfer(",255,");"]
["SPI.transfer(","0x01",");"]
["SPI.transfer(",255,");"]
["SPI.transfer(","0x01",");"]
["SPI.transfer(",255,");"]
["SPI.transfer(","0x01",");"]
["SPI.transfer(",255,");"]
["SPI.transfer(","0x01",");"]
["SPI.transfer(",255,");"]
["SPI.transfer(","0x01",");"]
["SPI.transfer(",255,");"]
["SPI.transfer(","0x01",");"]
["SPI.transfer(",255,");"]
["SPI.transfer(","0x01",");"]
["SPI.transfer(",255,");"]
["SPI.transfer(","0x01",");"]
["SPI.transfer(",255,");"]
["digitalWrite(","rt",",HIGH);"]
["","",""]
["","",""]
["digitalWrite(","rt",",LOW);"]
["SPI.transfer(","0x02",");"]
["SPI.transfer(",255,");"]
["SPI.transfer(","0x02",");"]
["SPI.transfer(",255,");"]
["SPI.transfer(","0x02",");"]
["SPI.transfer(",255,");"]
["SPI.transfer(","0x02",");"]
["SPI.transfer(",255,");"]
["SPI.transfer(","0x02",");"]
["SPI.transfer(",255,");"]
["SPI.transfer(","0x02",");"]
["SPI.transfer(",255,");"]
["SPI.transfer(","0x02",");"]
["SPI.transfer(",255,");"]
["SPI.transfer(","0x02",");"]
["SPI.transfer(",255,");"]
["SPI.transfer(","0x02",");"]
["SPI.transfer(",255,");"]
["SPI.transfer(","0x02",");"]
["SPI.transfer(",255,");"]
["SPI.transfer(","0x02",");"]
["SPI.transfer(",255,");"]
["SPI.transfer(","0x02",");"]
["SPI.transfer(",255,");"]
["digitalWrite(","rt",",HIGH);"]
["","",""]
["","",""]
["digitalWrite(","rt",",LOW);"]
["SPI.transfer(","0x03",");"]
["SPI.transfer(",255,");"]
["SPI.transfer(","0x03",");"]
["SPI.transfer(",255,");"]
["SPI.transfer(","0x03",");"]
["SPI.transfer(",255,");"]
["SPI.transfer(","0x03",");"]
["SPI.transfer(",255,");"]
["SPI.transfer(","0x03",");"]
["SPI.transfer(",255,");"]
["SPI.transfer(","0x03",");"]
["SPI.transfer(",255,");"]
["SPI.transfer(","0x03",");"]
["SPI.transfer(",255,");"]
["SPI.transfer(","0x03",");"]
["SPI.transfer(",255,");"]
["SPI.transfer(","0x03",");"]
["SPI.transfer(",255,");"]
["SPI.transfer(","0x03",");"]
["SPI.transfer(",255,");"]
["SPI.transfer(","0x03",");"]
["SPI.transfer(",255,");"]
["SPI.transfer(","0x03",");"]
["SPI.transfer(",255,");"]
["digitalWrite(","rt",",HIGH);"]
["","",""]
["","",""]
["digitalWrite(","rt",",LOW);"]
["SPI.transfer(","0x04",");"]
["SPI.transfer(",255,");"]
["SPI.transfer(","0x04",");"]
["SPI.transfer(",255,");"]
["SPI.transfer(","0x04",");"]
["SPI.transfer(",255,");"]
["SPI.transfer(","0x04",");"]
["SPI.transfer(",255,");"]
["SPI.transfer(","0x04",");"]
["SPI.transfer(",255,");"]
["SPI.transfer(","0x04",");"]
["SPI.transfer(",255,");"]
["SPI.transfer(","0x04",");"]
["SPI.transfer(",255,");"]
["SPI.transfer(","0x04",");"]
["SPI.transfer(",255,");"]
["SPI.transfer(","0x04",");"]
["SPI.transfer(",255,");"]
["SPI.transfer(","0x04",");"]
["SPI.transfer(",255,");"]
["SPI.transfer(","0x04",");"]
["SPI.transfer(",255,");"]
["SPI.transfer(","0x04",");"]
["SPI.transfer(",255,");"]
["digitalWrite(","rt",",HIGH);"]
["","",""]
["","",""]
["digitalWrite(","rt",",LOW);"]
["SPI.transfer(","0x05",");"]
["SPI.transfer(",255,");"]
["SPI.transfer(","0x05",");"]
["SPI.transfer(",255,");"]
["SPI.transfer(","0x05",");"]
["SPI.transfer(",255,");"]
["SPI.transfer(","0x05",");"]
["SPI.transfer(",255,");"]
["SPI.transfer(","0x05",");"]
["SPI.transfer(",255,");"]
["SPI.transfer(","0x05",");"]
["SPI.transfer(",255,");"]
["SPI.transfer(","0x05",");"]
["SPI.transfer(",255,");"]
["SPI.transfer(","0x05",");"]
["SPI.transfer(",255,");"]
["SPI.transfer(","0x05",");"]
["SPI.transfer(",255,");"]
["SPI.transfer(","0x05",");"]
["SPI.transfer(",255,");"]
["SPI.transfer(","0x05",");"]
["SPI.transfer(",255,");"]
["SPI.transfer(","0x05",");"]
["SPI.transfer(",255,");"]
["digitalWrite(","rt",",HIGH);"]
["","",""]
["","",""]
["digitalWrite(","rt",",LOW);"]
["SPI.transfer(","0x06",");"]
["SPI.transfer(",255,");"]
["SPI.transfer(","0x06",");"]
["SPI.transfer(",255,");"]
["SPI.transfer(","0x06",");"]
["SPI.transfer(",255,");"]
["SPI.transfer(","0x06",");"]
["SPI.transfer(",255,");"]
["SPI.transfer(","0x06",");"]
["SPI.transfer(",255,");"]
["SPI.transfer(","0x06",");"]
["SPI.transfer(",255,");"]
["SPI.transfer(","0x06",");"]
["SPI.transfer(",255,");"]
["SPI.transfer(","0x06",");"]
["SPI.transfer(",255,");"]
["SPI.transfer(","0x06",");"]
["SPI.transfer(",255,");"]
["SPI.transfer(","0x06",");"]
["SPI.transfer(",255,");"]
["SPI.transfer(","0x06",");"]
["SPI.transfer(",255,");"]
["SPI.transfer(","0x06",");"]
["SPI.transfer(",255,");"]
["digitalWrite(","rt",",HIGH);"]
["","",""]
["","",""]
["digitalWrite(","rt",",LOW);"]
["SPI.transfer(","0x07",");"]
["SPI.transfer(",255,");"]
["SPI.transfer(","0x07",");"]
["SPI.transfer(",255,");"]
["SPI.transfer(","0x07",");"]
["SPI.transfer(",255,");"]
["SPI.transfer(","0x07",");"]
["SPI.transfer(",255,");"]
["SPI.transfer(","0x07",");"]
["SPI.transfer(",255,");"]
["SPI.transfer(","0x07",");"]
["SPI.transfer(",255,");"]
["SPI.transfer(","0x07",");"]
["SPI.transfer(",255,");"]
["SPI.transfer(","0x07",");"]
["SPI.transfer(",255,");"]
["SPI.transfer(","0x07",");"]
["SPI.transfer(",255,");"]
["SPI.transfer(","0x07",");"]
["SPI.transfer(",255,");"]
["SPI.transfer(","0x07",");"]
["SPI.transfer(",255,");"]
["SPI.transfer(","0x07",");"]
["SPI.transfer(",255,");"]
["digitalWrite(","rt",",HIGH);"]
["","",""]
["","",""]
["digitalWrite(","rt",",LOW);"]
["SPI.transfer(","0x08",");"]
["SPI.transfer(",255,");"]
["SPI.transfer(","0x08",");"]
["SPI.transfer(",255,");"]
["SPI.transfer(","0x08",");"]
["SPI.transfer(",255,");"]
["SPI.transfer(","0x08",");"]
["SPI.transfer(",255,");"]
["SPI.transfer(","0x08",");"]
["SPI.transfer(",255,");"]
["SPI.transfer(","0x08",");"]
["SPI.transfer(",255,");"]
["SPI.transfer(","0x08",");"]
["SPI.transfer(",255,");"]
["SPI.transfer(","0x08",");"]
["SPI.transfer(",255,");"]
["SPI.transfer(","0x08",");"]
["SPI.transfer(",255,");"]
["SPI.transfer(","0x08",");"]
["SPI.transfer(",255,");"]
["SPI.transfer(","0x08",");"]
["SPI.transfer(",255,");"]
["SPI.transfer(","0x08",");"]
["SPI.transfer(",255,");"]
["digitalWrite(","rt",",HIGH);"]
["","",""]

{"sheet":"ArduinoProgramm MUSTER","index":3,"n_rows":224,"n_cols":3,"rows_kept":224,"cut":false,"hidden":false,"merged":[]}
["","",""]
["digitalWrite(","rt",",LOW);"]
["SPI.transfer(","0x01",");"]
["SPI.transfer(",255,");"]
["SPI.transfer(","0x01",");"]
["SPI.transfer(",255,");"]
["SPI.transfer(","0x01",");"]
["SPI.transfer(",255,");"]
["SPI.transfer(","0x01",");"]
["SPI.transfer(",255,");"]
["SPI.transfer(","0x01",");"]
["SPI.transfer(",255,");"]
["SPI.transfer(","0x01",");"]
["SPI.transfer(",255,");"]
["SPI.transfer(","0x01",");"]
["SPI.transfer(",255,");"]
["SPI.transfer(","0x01",");"]
["SPI.transfer(",255,");"]
["SPI.transfer(","0x01",");"]
["SPI.transfer(",255,");"]
["SPI.transfer(","0x01",");"]
["SPI.transfer(",255,");"]
["SPI.transfer(","0x01",");"]
["SPI.transfer(",255,");"]
["SPI.transfer(","0x01",");"]
["SPI.transfer(",255,");"]
["digitalWrite(","rt",",HIGH);"]
["","",""]
["","",""]
["digitalWrite(","rt",",LOW);"]
["SPI.transfer(","0x02",");"]
["SPI.transfer(",255,");"]
["SPI.transfer(","0x02",");"]
["SPI.transfer(",255,");"]
["SPI.transfer(","0x02",");"]
["SPI.transfer(",255,");"]
["SPI.transfer(","0x02",");"]
["SPI.transfer(",255,");"]
["SPI.transfer(","0x02",");"]
["SPI.transfer(",255,");"]
["SPI.transfer(","0x02",");"]
["SPI.transfer(",255,");"]
["SPI.transfer(","0x02",");"]
["SPI.transfer(",255,");"]
["SPI.transfer(","0x02",");"]
["SPI.transfer(",255,");"]
["SPI.transfer(","0x02",");"]
["SPI.transfer(",255,");"]
["SPI.transfer(","0x02",");"]
["SPI.transfer(",255,");"]
["SPI.transfer(","0x02",");"]
["SPI.transfer(",255,");"]
["SPI.transfer(","0x02",");"]
["SPI.transfer(",255,");"]
["digitalWrite(","rt",",HIGH);"]
["","",""]
["","",""]
["digitalWrite(","rt",",LOW);"]
["SPI.transfer(","0x03",");"]
["SPI.transfer(",255,");"]
["SPI.transfer(","0x03",");"]
["SPI.transfer(",255,");"]
["SPI.transfer(","0x03",");"]
["SPI.transfer(",255,");"]
["SPI.transfer(","0x03",");"]
["SPI.transfer(",255,");"]
["SPI.transfer(","0x03",");"]
["SPI.transfer(",255,");"]
["SPI.transfer(","0x03",");"]
["SPI.transfer(",255,");"]
["SPI.transfer(","0x03",");"]
["SPI.transfer(",255,");"]
["SPI.transfer(","0x03",");"]
["SPI.transfer(",255,");"]
["SPI.transfer(","0x03",");"]
["SPI.transfer(",255,");"]
["SPI.transfer(","0x03",");"]
["SPI.transfer(",255,");"]
["SPI.transfer(","0x03",");"]
["SPI.transfer(",255,");"]
["SPI.transfer(","0x03",");"]
["SPI.transfer(",255,");"]
["digitalWrite(","rt",",HIGH);"]
["","",""]
["","",""]
["digitalWrite(","rt",",LOW);"]
["SPI.transfer(","0x04",");"]
["SPI.transfer(",255,");"]
["SPI.transfer(","0x04",");"]
["SPI.transfer(",255,");"]
["SPI.transfer(","0x04",");"]
["SPI.transfer(",255,");"]
["SPI.transfer(","0x04",");"]
["SPI.transfer(",255,");"]
["SPI.transfer(","0x04",");"]
["SPI.transfer(",255,");"]
["SPI.transfer(","0x04",");"]
["SPI.transfer(",255,");"]
["SPI.transfer(","0x04",");"]
["SPI.transfer(",255,");"]
["SPI.transfer(","0x04",");"]
["SPI.transfer(",255,");"]
["SPI.transfer(","0x04",");"]
["SPI.transfer(",255,");"]
["SPI.transfer(","0x04",");"]
["SPI.transfer(",255,");"]
["SPI.transfer(","0x04",");"]
["SPI.transfer(",255,");"]
["SPI.transfer(","0x04",");"]
["SPI.transfer(",255,");"]
["digitalWrite(","rt",",HIGH);"]
["","",""]
["","",""]
["digitalWrite(","rt",",LOW);"]
["SPI.transfer(","0x05",");"]
["SPI.transfer(",255,");"]
["SPI.transfer(","0x05",");"]
["SPI.transfer(",255,");"]
["SPI.transfer(","0x05",");"]
["SPI.transfer(",255,");"]
["SPI.transfer(","0x05",");"]
["SPI.transfer(",255,");"]
["SPI.transfer(","0x05",");"]
["SPI.transfer(",255,");"]
["SPI.transfer(","0x05",");"]
["SPI.transfer(",255,");"]
["SPI.transfer(","0x05",");"]
["SPI.transfer(",255,");"]
["SPI.transfer(","0x05",");"]
["SPI.transfer(",255,");"]
["SPI.transfer(","0x05",");"]
["SPI.transfer(",255,");"]
["SPI.transfer(","0x05",");"]
["SPI.transfer(",255,");"]
["SPI.transfer(","0x05",");"]
["SPI.transfer(",255,");"]
["SPI.transfer(","0x05",");"]
["SPI.transfer(",255,");"]
["digitalWrite(","rt",",HIGH);"]
["","",""]
["","",""]
["digitalWrite(","rt",",LOW);"]
["SPI.transfer(","0x06",");"]
["SPI.transfer(",255,");"]
["SPI.transfer(","0x06",");"]
["SPI.transfer(",255,");"]
["SPI.transfer(","0x06",");"]
["SPI.transfer(",255,");"]
["SPI.transfer(","0x06",");"]
["SPI.transfer(",255,");"]
["SPI.transfer(","0x06",");"]
["SPI.transfer(",255,");"]
["SPI.transfer(","0x06",");"]
["SPI.transfer(",255,");"]
["SPI.transfer(","0x06",");"]
["SPI.transfer(",255,");"]
["SPI.transfer(","0x06",");"]
["SPI.transfer(",255,");"]
["SPI.transfer(","0x06",");"]
["SPI.transfer(",255,");"]
["SPI.transfer(","0x06",");"]
["SPI.transfer(",255,");"]
["SPI.transfer(","0x06",");"]
["SPI.transfer(",255,");"]
["SPI.transfer(","0x06",");"]
["SPI.transfer(",255,");"]
["digitalWrite(","rt",",HIGH);"]
["","",""]
["","",""]
["digitalWrite(","rt",",LOW);"]
["SPI.transfer(","0x07",");"]
["SPI.transfer(",255,");"]
["SPI.transfer(","0x07",");"]
["SPI.transfer(",255,");"]
["SPI.transfer(","0x07",");"]
["SPI.transfer(",255,");"]
["SPI.transfer(","0x07",");"]
["SPI.transfer(",255,");"]
["SPI.transfer(","0x07",");"]
["SPI.transfer(",255,");"]
["SPI.transfer(","0x07",");"]
["SPI.transfer(",255,");"]
["SPI.transfer(","0x07",");"]
["SPI.transfer(",255,");"]
["SPI.transfer(","0x07",");"]
["SPI.transfer(",255,");"]
["SPI.transfer(","0x07",");"]
["SPI.transfer(",255,");"]
["SPI.transfer(","0x07",");"]
["SPI.transfer(",255,");"]
["SPI.transfer(","0x07",");"]
["SPI.transfer(",255,");"]
["SPI.transfer(","0x07",");"]
["SPI.transfer(",255,");"]
["digitalWrite(","rt",",HIGH);"]
["","",""]
["","",""]
["digitalWrite(","rt",",LOW);"]
["SPI.transfer(","0x08",");"]
["SPI.transfer(",255,");"]
["SPI.transfer(","0x08",");"]
["SPI.transfer(",255,");"]
["SPI.transfer(","0x08",");"]
["SPI.transfer(",255,");"]
["SPI.transfer(","0x08",");"]
["SPI.transfer(",255,");"]
["SPI.transfer(","0x08",");"]
["SPI.transfer(",255,");"]
["SPI.transfer(","0x08",");"]
["SPI.transfer(",255,");"]
["SPI.transfer(","0x08",");"]
["SPI.transfer(",255,");"]
["SPI.transfer(","0x08",");"]
["SPI.transfer(",255,");"]
["SPI.transfer(","0x08",");"]
["SPI.transfer(",255,");"]
["SPI.transfer(","0x08",");"]
["SPI.transfer(",255,");"]
["SPI.transfer(","0x08",");"]
["SPI.transfer(",255,");"]
["SPI.transfer(","0x08",");"]
["SPI.transfer(",255,");"]
["digitalWrite(","rt",",HIGH);"]
["","",""]