-
Thread
MMC SD library FAT16 FAT32 read write
flags fuer ffopen (sind die rueckgabewerte von ffopen, auf diese wird geprueft..) #define MMC_FILE_NEW 0 // datei existierte nicht, wurde gerade angelegt ! #define MMC_FILE_EXISTS 1 // datei existiert, es kann gelesen werden ! #define MMC_FILE_NOT_EXISTS 2 // datei existiert
); draw_string("File 'Data.bin' not found!",42,75,6,color_white); _delay_ms(1000); if(MMC_FILE_CREATED == ffopen("Data.bin",'c') ) { draw_string("create new File...",42,90,6,color_white); _delay_ms
-
Thread
ISE ERROR ConstraintSystem
:59 - Constraint <NET "Clk_FBp" S>: NET "Clk_FBp" not found. Please verify that: 1. The specified design element actually exists in the original design. 2. The specified object is spelled correctly in the constraint source file. ngdbuild ERROR ConstraintSystem:59 - Constraint <NET "Clkp" S>: NET "Clkp" not found. Please verify that: 1. The specified design element actually exists in the original design. 2. The specified object is spelled correctly in the constraint source file. Gruß Frank
-
Thread
EEPROM Probleme
LPK_AT90CAN128.elf] Error 1 Build succeeded with 1 Warnings... MESSAGE: gcc plug-in: Error: Object file not found on expected location N:\SystemTest\STA (System_Test_Automation)\Rabaschus\SignalSIM\AVR\Quellcode\LPK_AT90CAN128\default\LPK_AT90CAN128.elf Ich Checke das nicht...
-
Thread
ise 10.1 time constraints
ConstraintSystem:59 - Constraint <NET "my_clock" S>: NET "my_clock" not found. Please verify that: 1. The specified design element actually exists in the original design. 2. The specified object is spelled correctly in the constraint source file. ERROR:ConstraintSystem:59 - Constraint <NET "my_button" S>: NET "my_button" not found. Please verify that: 1. The specified design element actually exists in the original design. 2. The specified object is spelled correctly in the constraint source file. Done...
-
Thread
Atmega8 - DS1621 auslesen ( über TWI[ i2c]) Gesperrt
\ gcc plug-in: Error: Object file not found on expected location C:\TempDS1621\default\TempDS1621.elf gcc plug-in: Error: Object file not found on expected location C:\TempDS1621\default\TempDS1621.elf Hab das Projekt genauso
und wenn kein Programm erzeugt wird, kann das gcc-plugin auch keins finden (gcc plug-in: Error: Object file not found on expected location C:\TempDS1621\default\TempDS1621.elf). Die Fehlermeldung des Linkers steht eventuell auf einem anderen Fenster (Tabellenreiter Build?) in AVRStudio. Wieso
-
Thread
zeitabschnitt warten
ud8fff~1 1>c:\winddk\3790.1830\inc\wxp\ntdef.h(84) : error C2220: warning treated as error - no object file generated 1>c:\winddk\3790.1830\inc\wxp\ntdef.h(84) : error C4005: 'MAX_NATURAL_ALIGNMENT' : macro redefinition 1>c:\winddk\3790.1830\inc\wxp\ntdef.h(111) : error C4005: 'PROBE_ALIGNMENT' :
ignored 1>LINK : LNK6004: C:\Documents and Settings\harald.schuster\Desktop\test\test2\Debug\test2.exe not found or not built by the last incremental link; performing full link 1>test.obj : warning LNK4229: invalid directive '/manifestdependency:type='win32' name='Microsoft.VC80.DebugCRT' version='8.0.50608.0
-
Thread
AVR Studio gcc plug-in: Error: Object file not found
: Error: Object file not found on expected location C:\...\pwm-test.elf es gibts hier zwar schon ein paar threads dazu aber irgendwie werde ich daraus nicht schlau. Irgendwas muss ich wohl übersehen. Kann mir jemand
pwm-test.elf c:/programme/winavr-20080430/bin/../lib/gcc/avr/4.3.0/../../../../avr/lib/avr4/crtm8.o: file not recognized: File format not recognized make: *** [pwm-test.elf] Error 1 Build succeeded with 0 Warnings...
-
Thread
zugriff auf AVR -SRAM in ASM und C
Dank an euch beide! Jetz bekomme ich allerdings dauernd die Fehlermeldung: gcc plug-in: Error: Object file not found on expected location C:\Dokumente und Einstellungen\......\dmx_asm_c_test.elf Irgendwie mag das AVR-Studio 4.14 mein Assembler-file nicht. Es ist mein erstes Projekt in dem ich
-
Thread
AVR Studio 4.12 Fehlermeldung noch einbinden von header
nicht das er die dateien nicht findet es kommt nur folgende fehlermeldung: gcc plug-in: Error: Object file not found on expected location \\btfs001v1.auto.contiwan.com\h\bth-users\x-broeckerm\Vorladezeit Projekt\funktionierende versionen\lcdneu\default\lcdneu.elf woran kann das liegen muss ich vllt
a) könntest du das ganze AVR Studio Projekt einstellen b) bindet man keine C-Files ein c) bringt das LCD Plugin probleme (weil es von einer Internetadresse geladen werden soll)
-
Thread
"undefined reference to" mit Makefile
und diese alle im selben Verzeichnis liegen, dann sollte folgendes im makefile stehen: # Target file name (without extension). TARGET = main # Object files directory # To put object files in current directory, use a dot (.), do NOT make # this an empty or blank macro! OBJDIR = .
# Object files directory # To put object files in current directory, use a dot (.), do NOT make # this an empty or blank macro! OBJDIR = ./obj Wobei das alles bei dir ja zu funktionieren scheint
-
Thread
Erweiterbares Ethernetboard mit MMC/SD-Slot und USB
aufgerufen und die TCP-Verbindung geschlossen. Für ein Beispiel schau Dir auch mal httpd_module_file_callback() an. Hier werden die Dateien der Speicherkarte stückweise rausgeschickt. Gruß, Roland
Das AVR-Studio mag aber mit dem makefile nicht richtig umgehen und wirft die bekannte Meldung "Object file not found on expected location". Deswegen habe ich ein Projektfile fürs Studio und einen Patch angehängt, evtl. hilft das dem einen oder anderen. Die richtigen Einstellungen fürs XMEM waren
-
Thread
[ISE 10.1] ConstraintSystem:59 Error
Hi, ich habe in meinem UCF File Nets und in der dazugehörigen Entity Signale auskommentiert. Ich verwende diese Signale im kompletten Design nicht mehr. Trotzdem bekomme ich beim Translate folgenden Fehler: ERROR:ConstraintSystem:59 - Constraint <NET "SECU1_OUT" S>: NET "SECU1_OUT" not found. Please verify that: 1. The specified design element actually exists in the original design. 2. The specified object is spelled correctly in the constraint source file. Ich meine
-
Thread
Linker Error
failed with 3 errors and 0 warnings... Wenn ich nach dem Übersetzen mit den Fehlermeldungen das File dann programmiere tuts. Vielleicht weiss ja jemand Rat! gruß tom
Exit-Code zu verwenden? Windows-Programmierer zu sein? Keine Ahnung, die berüchtigte Meldung ``Object file not found in expected location'' hängt ja auch damit zusammen, und ich habe schon vor einiger Zeit einen Bugreport dafür aufgemacht. Irgendwie muss man die Fehlermeldungen natürlich schon
-
Thread
elf problem ich krieg die krise
gleich erst ma kompiliert aber siehe da es kommt folgende fehlermeldung: gcc plug-in: Error: Object file not found on expected location T:\ELEKTRONIK\..dmx\default\testlauf.elf Da kam natürlich schon mal freude auf. :-) Aber es kommt noch besser.... Hab nen komplett neues Projekt als Test angelegt
return 0; } Und was kommt?? LOL die selbe Fehlermeldung noch einmal... gcc plug-in: Error: Object file not found on expected location T:\ELEKTRONIK\..dmx\default\testlauf.elf Aber woran liegt das bitte schön?? Kann mir das jemand erklären seit gestern habe ich nichts mehr daran gemacht auch
-
Thread
AVR Studio Fehler
plugin STK500 Loaded plugin AVR GCC Loaded partfile: D:\Programme\AVR_Studio\PartDescriptionFiles\ATtiny12.xml gcc plug-in: Error: Object file not found on expected location C:\Dokumente und Einstellungen\Steffen Oesterwind\Eigene Dateien\default\Ledeinb.elf --------------------------------
Hi, die Meldung "gcc plug-in: Error: Object file not found on expected location" ist nur ein Folgefehler. Der eigentliche Fehler ist der andere mit "CreateProcess ... failed". Meistens stimmt die PATH Variable dann nicht. CU
-
Thread
Compiler Error von WinAVR als Plugin zu AVRStudio
installiert ist auch das neueste WinAVR). Nun bekomme ich leider de Meldung: gcc plug-in: Error: Object file not found on expected location F:\projects\smartLink\firmware\smartLink\default\smartLink.elf natürlich liegt an der besagten Stelle wiklich kein .elf File, aber sollte das nicht der Compiler
http://www.mikrocontroller.net/articles/WinAVR#gcc_plug-in:_Error:_Object_file_not_found_on_expected_location
-
Thread
Mega16 & S65 Disaply "HelloWorld"-Test merkwürdige Fehlermeldung
Okay, habe ich getan. Nun meckert er, dass er das .elf-File nicht findet. gcc plug-in: Error: Object file not found on expected location E:\Elektronik-Projekte\ATMEL\S65_Grafikdispl\default\S65_Grafikdispl.elf Unter Build steht nun: ../lcd.s:58: Error:
-
Thread
AVR-Bootloader mit Verschlüsselung
baudrate to 19200 06.05.09-16:36:58-468 > Error: can not setup baudrate to 19200 06.05.09-16:36:58-515 > Error: can not setup baudrate to 19200 06.05.09-16:36:58-578 > Error: no Device found
! AVrootloader.exe gestartet und ein PowerCycle am Board --> AVrootloader melde Device not found. Über einen Tipp wäre ich sehr dankbar, da es mit den Mega88PA einwandfrei funktioniert! Beste Grüße, Michael
-
Thread
Problem bei LCD Ansteuerung
lcd-routines.h erstellt und in denselben Ordner getan. Jetzt bekomme ich die Meldung: gcc plug-in: Error: Object file not found on expected location J:\Dokumente und Einstellungen\M.Justinger\Desktop\LCD_Test\default\LCD_Test.elf Die Datei gibt es auch nicht, ich weis auch nicht was das für eine Datei ist
erstellt und in denselben Ordner getan. > Jetzt bekomme ich die Meldung: > > gcc plug-in: Error: Object file not found on expected location > J:\Dokumente und > Einstellungen\M.Justinger\Desktop\LCD_Test\default\LCD_Test.elf Punkt 1 Es ist in vielen Fällen unklug, in Dateinamen Dinge wie Leerzeichen
-
Thread
Problem mit WinAVR/AVR-STudio
dass eine *ELF* Datei fehlt. http://www.mikrocontroller.net/articles/WinAVR#gcc_plug-in:_Error:_Object_file_not_found_on_expected_location Man sollte dann vom Message-Tab zum Build-Tab wechseln, und nachsehen, was im Sourcecode falsch ist und warum der Kopilierversuch abgebrochen wurde.
-
Thread
Asm in AVR GCC?
" "dec r17" "brne delay2" "dec r16" "brne delay1" "ret" ); } // gcc plug-in: Error: Object file not found on expected location C:\Tests\gcc\default\qwerty.elf
ATMega1281 gesetzt wird. Hierbei ist das Setzen des Ports in einer Assembler Datei codiert, deren Object dann zum C-Object dazugelinkt wird. Vielleicht hilft es ja :-)
-
Thread
LCD Atmega8535 fehler beim Programm erstellen mit AVR-Studio
Fehlermeldungen habe ich wegbekommen, doch jetzt ist ein neuer Fehler aufgetaucht: gcc plug-in: Error: Object file not found on expected location M:\Mikrocontroller\lcd_chris\default\lcd_chris.elf Was muss ich jetzt machen. Muss ich an der lcd.c, die ich im Source-Files hinzugefügt habe noch was ändern,
> gcc plug-in: Error: Object file not found on expected location http://www.mikrocontroller.net/articles/WinAVR#gcc_plug-in:_Error:_Object_file_not_found_on_expected_location Alle Einstellarbeiten sollten nur in lcd.h gemacht
-
Thread
Bootloader für den ATmega 168 macht Probleme
Baudrate 2400 [/c] Wenn ich auf kompilieren gehe kommt folgende Message: gcc plug-in: Error: Object file not found on expected location D:\Eigene Dateien\schule\elektro\Asuro\c-programme\bootloader\default\bootloader.elf Und folgendes Buildprotokoll: Build started 23.2.2008 at 17:35:14 avr-gcc.exe
-
Thread
Plugin Fehler bei AVR-Studio und GCC
Loaded Plugin STK500 Loaded Plugin AVR GCC Loaded Partfile c:\...ATMega128.xml gcc plug-in: Error: Object file not found on expected location c:\....elf Weiss jemand was das ist ? Ein Obejctfile kann es noch gar nicht geben, der Compiler ist ja noch nicht gestartet.... Greets Karlheinz
Moment sogar schon fertig. Es hat aber beim Compilieren offenbar einen Fehler gegeben, weshalb kein Object-File erzeugt wurde, weshalb der Linker meckert...
-
Thread
Wo ist die util/delay.h?
hrm joa gemacht...neuste version drauf gemacht.... nun bekomme ich das "gcc plug-in: Error: Object file not found on expected location Y:\C\07.LCD-Display\LCD\default\LCD.elf"
gemacht...neuste version drauf gemacht.... > > nun bekomme ich das > > "gcc plug-in: Error: Object file not found on expected location > Y:\C\07.LCD-Display\LCD\default\LCD.elf" http://www.mikrocontroller.net/articles/WinAVR#gcc_plug-in:_Error:_Object_file_not_found_on_expected_location
-
Thread
AVR Studio - *.elf Problem mit Funktionen
Der Compiler des Studio's gibt mir im Message-Fenster die Meldung aus: [pre]gcc plug-in: Error: Object file not found on expected location C:\Dokumente und Einstellungen\jh\Eigene Dateien\atmega128_code_samples\main\default\main.elf [/pre] Das Build-Fenster meldet: [pre] rm -rf main.o function.o
benötigten .c-Dateien angeben. Damit funktioniert das dann auch mit make ohne includieren von .c-Files. .h-Dateien müssen im übrigen immer includiert werden, in jedem !! .c-File. Das geht nicht "automatisch". Viel Erfolg Oliver
-
Thread
VB2005-DLL einbinden
Card " + Str(h) + " connected" Case -1 Label1.Text = "Card " + Str(CardAddress) + " not found" End Select End Sub Private Sub Form_Terminate() CloseDevice() End Sub Private Sub Button1_Click(ByVal sender As System.Object, ByVal e As System.EventArgs) Handles Connect.Click
application is terminated End Sub 'Private Sub Button1_Click(ByVal sender As System.Object, ByVal e As System.EventArgs) ' Connect_Click() 'End Sub Private Sub OpenScriptButton_Click(ByVal sender As System.Object, ByVal e As System.EventArgs) Handles OpenScriptButton.Click
-
Thread
Taster abfragen UND dann.
ok danke: Nächstes Problem: Object file not found.... habe avr-studio geschlossen und wieder geöffnet, jetzt geht das kompilieren plötzlich mit oben genanntem fehler nicht!! :(
-
Thread
Probleme mit AVR Studio 4.13!
Wenn ich das Programm erstellen will (F7) bekomme ich folgenden Fehler: gcc plug-in: Error: Object File not found on expected location D:\default\datei.elf kann mir jemand helfen ??? PS: Arbeite mit Windows Vista ;)
-
Thread
CC5X Aufruf Unterprogramm Problem
soweit, jedoch bekomme ich beim buliden von "haupt.c" die Fehlermeldung: Assembler 'C:\Program Files\Microchip\MPASM Suite\mpasmwin.exe' not found. Im selben Projekt lässt sich die Datei "timer.c" aber ohne Fehler compailieren, also ist der Pfad bekannt..... Im Projekt selbst ist alles eingebunden
weiß aber nicht warum....) Beim direkten wandeln mit MPASMWIN.exe kommt ein Fehler und im LOG-File steht: "Directive only allowed when generating an object file" Kann damit aber nichts anfangen, da ich nicht weiß was object-files sind :-( Wo liegt das Problem ??? Mino //________________
-
Thread
ARM7 Eclipse / Debuggen geht, flashen nicht?
Name and Make Target to "program") # # OpenOCD is run in "batch" mode with a special configuration file and a script file containing # the flash commands. When flash programming completes, OpenOCD terminates. # # Note that the script file of flash commands (script.ocd) is part of the project # #
************************************************ # specify output filename here (must be *.bin file) TARGET = main.bin # specify the directory where openocd executable and configuration files reside (note: use forward slashes /) OPENOCD_DIR = 'd:/Programme/openocd-2007re204/bin/' # specify
-
Thread
Array ins eeprom schreiben
Hallo wenn ich ein Array im eeprom definiere kommt immer der Fehler "gcc plug-in: Error: Object file not found on expected location C:\Dokumente und Einstellungen\Administrator\Eigene Dateien\Robotik\Projekte\C\Quattrokopter\Parabox\default\Parabox.elf" die eeprom.h habe ich auch includiert
@ Gast (Gast) >plug-in: Error: Object file not found on expected location C:\Dokumente >und Einstellungen\Administrator\Eigene >Dateien\Robotik\Projekte\C\Quattrokopter\Parabox\default\Parabox.elf" Dein Pfad enthält Leerzeichen, das
-
Thread
Assembler in Makefile einbinden funktioniert nicht
C. Nun wollte ich per Makefile die Asseblerdatei einbinden, aber Makefile meint immer "Oops, ASRC not found" Ich habe den Pfad schon auf verschiedene weisen versucht einzugeben Z.B. C:\testen\speicher_fft\ffft.S C:\testen\speicher_fft\ffft C:/testen/speicher_fft/ffft.S C:/testen
bei ASRC etwas eingetragen habe, sondern indem ich folgende Zeile geändert habe: # Define all object files. OBJ = speicher_fft.o fft.o Ursprünglich sah die Zeile wie folgt aus: # Define all object files. OBJ = $(SRC:%.c=$(OBJDIR)/%.o) $(CPPSRC:%.cpp=$(OBJDIR)/%.o) $(ASRC:%.S=$(OBJDIR)/%.o)
-
Thread
WinAVR mit Makefile erzeugt Fehler *.elf
Hallo, ich vresuche gerade mit einem vom Makefile erstelltem file, mein Project zu compilieren. Leider funktioniert das nicht so recht. Es kommt ständig die folgende Feherlmeldung: gcc plug-in: Error: Object file not found on expected location C:\testen\speichertest
http://www.mikrocontroller.net/articles/WinAVR#gcc_plug-in:_Error:_Object_file_not_found_on_expected_location
-
Thread
Assembler Datei .S in C-Project einbinden
bisschen verändert (siehe Anhang). Leider klappt das nicht, Fehlermeldung ist: "gcc plug-in: Error: Object file not found on expected location C:\Dokumente und Einstellungen\Hans-Peter\Eigene Dateien\Entwicklung\TurningWord 1.0\source\µC\default\TurningWord.elf" Im nächsten Beitrag werde ich mein Default-Makefile
-
Thread
Komischer Fehler, wenn die Optimierung auf O0 gestellt wird
defined here make: *** [AVRDebug.elf] Error 1 und 16-Dec-2007 16:44:50 gcc plug-in: Error: Object file not found on expected location E:\Project\PIC Programmer MCU SW\AVRDebug\default\AVRDebug.elf . Ich habe jetzt herausgefunden, dass der Fehler nur auftritt, wenn ich die sin() Funktion verwende
: AmadeusTraceAVR.h: No such file or directory main.c:6: warning: function declaration isn't a prototype main.c: In function 'main': main.c:8: warning: implicit declaration of function 'ATInit' main.c:12: warning: implicit declaration
-
Thread
Headerdatei der main lässt sich nich includen
. wenn ich jetzt aber die gps.h in der mmc.h includen will, sagt er mir: gcc plug-in: Error: Object file not found on expected location D:\Projekte\GPS\GPS.elf Make sure your makefile specifies the output .elf file as GPS.elf wenn ich die GPS.h in der mmc.h nicht include, funktioniert das compilen
-
Thread
wieder einmal "undifined reference"
util_crc <util/crc16.h>: CRC Computations \code#include <util/crc16.h>\endcode This header file provides a optimized inline functions for calculating cyclic redundancy checks (CRC) using common polynomials. \par References: \par See the Dallas Semiconductor app note 27
Verdammt. Danke. :) Das war der Fehler. Jetzt bekomm ich aber gcc plug-in: Error: Object file not found on expected location C:\AVR\RS485\default\rs485.elf Hier mal die "Build" Ausgabe. Alles darin ist leider nicht auf meinem Mist gewachsen. :) [c] Build started 24.11.2007 at 18
-
Thread
AvrStudio findet/macht keine elf mehr
sobald ich versuche ne Hex zu machen ("Build") kommt immer diese Fehlermeldung: gcc plug-in: Error: Object file not found on expected location C:\AVR\UART\default\uart.elf Diese Meldung ist auh berechtigt, da diese dort, und nirgendwo anders existiert. Was tun? Wollte das Programm nur mal testen, aber
*** [main.o] Error 1 Build succeeded with 2 Warnings... Message: gcc plug-in: Error: Object file not found on expected location C:\AVR\UART\default\uart.elf
-
Thread
.elf Fehler - kommt immer wieder und macht mich wahnsinnig Gesperrt
main() { int i; while(1) { } return 0; } [/c] Fehler: gcc plug-in: Error: Object file not found on expected location C:\temp\test\default\test.elf Bitte dringend um Hilfe, werde sonst meine Tastatur mit dem Monitor bekannt machen ;) (...) ____ AVRStudio v4.13 ServicePack
Ursachen findest Du mit Hilfe der erwähnten Suchfunktion: http://www.mikrocontroller.net/search?query=Object+file+not+found Auch das Wiki enhält einen entsprechenden Abschnitt: http://www.mikrocontroller.net/articles/WinAVR#gcc_plug-in:_Error:_Object_file_not_found_on_expected_location Inclusive weiterer
-
Thread
Problem mit elf-file im AVR Studio
Wenn ich dann compiliere, kommt immer folgende Meldung im Message-Fenster: gcc plug-in: Error: Object file not found on expected location C:\Dokumente und Einstellungen\test\Eigene Dateien\AVR-PROJEKTE\Projekte\Versuche gegen elf\test1\default\test1.elf Das Build-Fenster sieht wie folgt aus:
-
Thread
Webserver ATmega32/644DIP ENC28J60
etwas geändert. usart_write() kann jetzt mit %s auch Strings aus dem RAM ausgeben. usart_write("File found %s\r\n",http_entry[index].filename); Altes usart.c einfach ersetzen. Gruß holger
nochmal der Link: http://www-public.tu-bs.de:8080/~y0027190/final%20board%20for%20123mmx71mm%20box-%20not%20tested/ Dort findet man die Eagle Files und einige Bilder vom fertigem Aufbau mit Gehäuse. Grüße Henning
-
Thread
AVR Studio mal wieder
compiliert und simuliert habe, bekomme ich auf einmal die nächste Fehlermeldung: "gcc plug-in: Error: Object file not found on expected location E:\Work\ATmel\LCD\default\LCD.elf" An was kann das liegen und was muss ich einstellen, dass es wieder ok ist?? Gruß