-
Thread
AVRdude hängt beim flashen
20000000 F_CPU = 8000000 # Output format. (can be srec, ihex, binary) FORMAT = ihex # Target file name (without extension). TARGET = main # Object files directory # To put object files in current directory, use a dot (.), do NOT make # this an empty or blank macro! OBJDIR = .
) $@ $(NM) -n $< > $@ # Create library from object files. .SECONDARY : $(TARGET).a .PRECIOUS : $(OBJ) %.a: $(OBJ) @echo @echo $(MSG_CREATING_LIBRARY) $@ $(AR) $@ $(OBJ) # Link: create ELF output file from object files. .SECONDARY
-
Thread
Hterm unter Linux Mint Cinnamon
.6 => not found libXrender.so.1 => not found libXi.so.6 => not found libXrandr.so.2 => not found libXcursor.so.1 => not found libXfixes.so.3 => not found libpango-1.0.so.0 => not found libX11.so.6 => not found libgobject-2.0.so.0 => not found libgmodule-2.0.so.0 => not found libgthread-2.0.so.0 => not found libglib-2.0.so.0 => not found libXinerama.so.1 => not found libSM.so.6 => not
-
Thread
Helpthread zum Wikiartikel AVR Eclipse
Ordner, dann bekomme ich folgende Ausgabe: [pre] make --no-print-directory post-build Invoking: Object to Hex Splitter avr-objsplit.bat /usr/bin/avr-objsplit.bat: 1: @avr-objcopy: not found /usr/bin/avr-objsplit.bat: 2: @avr-objcopy: not found /usr/bin/avr-objsplit.bat: 3: @if: not found make[1
im Wiki, dann schaut das ganze so aus: [pre] make --no-print-directory post-build Invoking: Object to Hex Splitter avr-objsplit.bat make[1]: avr-objsplit.bat: Command not found make[1]: [post-build] Error 127 (ignored)) [/pre] Die beiden Dateien liegen im /usr/bin/-Ordner und haben executable-Rechte
-
Thread
KiCad-Kompilierung
Python-2.7.11/ (Zeile 3) nicht existiert. Angeblich wird eine Datei daraus benutzt, es gibt aber kein "File not found". Jemand ne Idee? [pre] [...] [ 78%] Linking CXX shared module _pcbnew.so /usr/local/lib/libpython2.7.a(posixmodule.o): In function `posix_tmpnam': /Daten/Downloads/Python-2.7.11
2.7.11/ (Zeile 3) nicht existiert. Angeblich > wird eine Datei daraus benutzt, es gibt aber kein "File not found". Möglicherweise benötigst Du noch swig und wxPython aus dem Repository Ich habe mich bei meiner letzten Compilation im Herbst hieran orientiert: http://ci.kicad-pcb.org/job/kicad-doxygen
-
Thread
Array ins eeprom schreiben
Hallo wenn ich ein Array im eeprom definiere kommt immer der Fehler "gcc plug-in: Error: Object file not found on expected location C:\Dokumente und Einstellungen\Administrator\Eigene Dateien\Robotik\Projekte\C\Quattrokopter\Parabox\default\Parabox.elf" die eeprom.h habe ich auch includiert
@ Gast (Gast) >plug-in: Error: Object file not found on expected location C:\Dokumente >und Einstellungen\Administrator\Eigene >Dateien\Robotik\Projekte\C\Quattrokopter\Parabox\default\Parabox.elf" Dein Pfad enthält Leerzeichen, das
-
Thread
LPC1768 OpenOCD arm-none-eabi-gcc 5.3.0
flash 'lpc2000' found at 0x00000000 > flash write_image erase /home/pheinrich/workspace/netplug/Test/Debug/Test.elf auto erase enabled wrote 4096 bytes from file /home/pheinrich/workspace/netplug/Test/Debug/Test.elf
modify build tools on developer PC to inject correct LPC vector checksum. wrote 4096 bytes from file /home/pheinrich/workspace/netplug/Test/Debug/lpc_test2.axf in 0.309931s (12.906 KiB/s) > reset run JTAG tap: lpc17xx.cpu tap/device found: 0x4ba00477 (mfg: 0x23b, part: 0xba00, ver: 0x4) [/c]
-
Thread
toolchain für STM8 unter Windows
variable : 'ui8_value' main.c:534: warning 85: in function main unreferenced local variable : 'objects_readed' hex2bin -p 00 bin/main.ihx HEX TO BIN FILE CONVERTER V1.1 Copyright Raisonance S.A. 2004 ERROR: Cannot open the input file.make: *** [main] Error 1 X:\work>cd bin X:\work\bin>hex2bin
Hmm, jetzt stehe ich vor dem Problem, das hex-file zu flashen. Wenn ich das ihx-File im ST Visual Programmer öffnen will, kommen jede Menge Fehler, daß der Adressbereich nicht passt. Das stm8flash.exe Tool von https://github.com/tenbaht/sduino-windowstools
-
Thread
AvrStudio findet/macht keine elf mehr
sobald ich versuche ne Hex zu machen ("Build") kommt immer diese Fehlermeldung: gcc plug-in: Error: Object file not found on expected location C:\AVR\UART\default\uart.elf Diese Meldung ist auh berechtigt, da diese dort, und nirgendwo anders existiert. Was tun? Wollte das Programm nur mal testen, aber
*** [main.o] Error 1 Build succeeded with 2 Warnings... Message: gcc plug-in: Error: Object file not found on expected location C:\AVR\UART\default\uart.elf
-
Thread
cmake: Create a hex-file with an AVR compiler
.dir\link.txt --verbose=1 "C:\Program Files (x86)\CMake 2.8\bin\cmake.exe" -E remove -f CMakeFiles\cmTryCompileExec2122687935.dir/objects.a C:\WinAVR-20100110\bin\avr-ar.exe cr CMakeFiles\cmTryCompileExec2122687935.dir/objects.a @CMakeFiles\cmTryCompileExec2122687935.dir\objects1.rsp C:\WinAVR-20100110\bin\avr-gcc.exe -Wl,--whole-archive CMakeFiles\cmTryCompileExec2122687935.dir/objects.a -Wl,--no-whole-archive -o cmTryCompileExec2122687935
-
Thread
Verilog inout "NET "IIC_SDA_SFP" not found"
Hallo, ich versuche einen inout Port in Verilog zu nutzen. Im Constraints File habe ich ihn folgendermaßen angegeben: [vhdl]NET "IIC_SDA_SFP" LOC = "E6"; ## 4 on P2[/vhdl] In meinem Top Modul rufe ich ihn wie folgt auf: [vhdl]inout IIC_SDA_SFP,[/vhdl] Wenn ich es so
ConstraintSystem:59 - Constraint <NET "IIC_SDA_SFP" LOC = "E6";> [constraints.ucf(31)]: NET "IIC_SDA_SFP" not found. Please verify that: 1. The specified design element actually exists in the original design. 2. The specified object is spelled correctly in the constraint source file. Um das Modul
-
Thread
Xilinx ISE Pinzuordnung an Sparten 3E
ConstraintSystem:59 - Constraint <NET "led<0>" LOC = "M5" ;> [Basys2_100_250General.ucf(2)]: NET "led<0>" not found. Please verify that: 1. The specified design element actually exists in the original design. 2. The specified object is spelled correctly in the constraint source file. Als Package
ConstraintSystem:59 - Constraint <NET "led<0>" LOC = "M5" ;> [Basys2_100_250General.ucf(2)]: NET "led<0>" not found. Please verify that: 1. The specified design element actually exists in the original design. 2. The specified object is spelled correctly in the constraint source file. WARNING: ConstraintSystem
-
Thread
Kein Zugriff zum Programmer mit AVRDUDE unter Wine (Ubuntu 22.04)
i386. > > evtl. > sudo dpkg --add-architecture i386 > ? guifrmwrk.so: cannot open shared object file: No such file or directory
[code] ldd guifrmwrk.so linux-gate.so.1 (0xf7f1d000) libgtk-x11-2.0.so.0 => not found libgdk-x11-2.0.so.0 => not found libatk-1.0.so.0 => not found libgdk_pixbuf-2.0.so.0 => /lib/i386-linux-gnu/libgdk_pixbuf-2.0.so.0 (0xf7bcd000) libpangocairo
-
Thread
LCD Atmega8535 fehler beim Programm erstellen mit AVR-Studio
Fehlermeldungen habe ich wegbekommen, doch jetzt ist ein neuer Fehler aufgetaucht: gcc plug-in: Error: Object file not found on expected location M:\Mikrocontroller\lcd_chris\default\lcd_chris.elf Was muss ich jetzt machen. Muss ich an der lcd.c, die ich im Source-Files hinzugefügt habe noch was ändern,
> gcc plug-in: Error: Object file not found on expected location http://www.mikrocontroller.net/articles/WinAVR#gcc_plug-in:_Error:_Object_file_not_found_on_expected_location Alle Einstellarbeiten sollten nur in lcd.h gemacht
-
Thread
Scriptengine für zrtos
404 page not found.
namespace llvm; int main() { // llvm::InitializeNativeTarget(); // read byte-code from file auto Buffer = llvm::MemoryBuffer::getFile("./test.bc"); if (Buffer.getError()){ llvm::errs() << "test.bc not found\n"; return -1; } auto MemoryBuffer = Buffer.get
-
Thread
16x2 Modul UV-Belichter
Uv-Belichter nachzubauen > (http://www.endorphino.de/projects/electronics/belichter/index.html).Leider Object not found ..... Vielleicht so: http://www.endorphino.de/projects/electronics/belichter/index.html
Eberhard F. schrieb im Beitrag #3878078: > Object not found ..... Man... bist du pingelig... http://www.endorphino.de/projects/electronics/belichter/index.html War doch nur ein verunglückter cut-and-paste :-)
-
Thread
cannot read spec file 'device-specs/specs-atmega4808'
avr/lib/avrtiny/attiny40 + rm -rf autom4te.cache + aclocal ./bootstrap: 25: ./bootstrap: aclocal: not found + autoheader ./bootstrap: 26: ./bootstrap: autoheader: not found + autoconf ./bootstrap: 27: ./bootstrap: autoconf: not found + automake --foreign --add-missing --copy ./bootstrap: 28: .
autotools (autoconf, autoheader, automake, ...) installieren. > ./bootstrap: 25: ./bootstrap: aclocal: not found > + autoheader > ./bootstrap: 26: ./bootstrap: autoheader: not found > + autoconf > ./bootstrap: 27: ./bootstrap: autoconf: not found > + automake --foreign --add-missing --copy > ./bootstrap
-
Thread
HTerm unter Linux shared libaries problem
not found libXi.so.6 => not found libXrandr.so.2 => not found libXcursor.so.1 => not found libXfixes.so.3 => not found libpango-1.0.so.0 => not found libX11.so.6 => not found libgobject-2.0.so.0 => not found libgmodule-2.0.so.0 => not found libgthread-2.0.so.0 => not found libglib-2.0.so.0 => not found libXinerama.so.1 => not found libSM.so.6 => not found libpng12.so.0 => not found
-
Thread
Bibliothek mit Crosscompiler übersetzen
gcc... gcc checking whether the C compiler works... yes checking for C compiler default output file name... a.out checking for suffix of executables... checking whether we are cross compiling... no checking for suffix of object files... o checking whether we are using the GNU C compiler... yes
arm-linux-gnueabi-ranlib geht... dann sudo arm-linux-gnueabi-ranlib sudo: arm-linux-gnueabi-ranlib: command not found Wie sag ichs dem sudo?
-
Thread
Pi Pico mit VSCode debuggen
bin/arm-none-eabi-gdb: error while loading shared libraries: libncursesw.so.5: cannot open shared object file: No such file or directory Error: Unable to start GDB even after 5 seconds or it couldn't even start Make sure you can start gdb from the command-line and run any command like "echo hello".
arm-none-eabi-gdb: error > while loading shared libraries: libncursesw.so.5: cannot open shared > object file: No such file or directory aptitude install libncursesw5
-
Thread
C# mehrdimensionale Listen in Excel übertragen
//btnAEM.IsEnabled = true; } catch (System.IO.FileNotFoundException) { Console.WriteLine("Datei konnte nicht gefunden werden!"); } } } private void BtnWire_Click
btnAEM.IsEnabled = true; } catch (System.IO.FileNotFoundException) { Console.WriteLine("Datei konnte nicht gefunden werden!"); } }
-
Thread
Fehlermeldung
Compilieren möchte, der Compiler gibt mir aber immer zum Schluss diese Meldung aus. gcc plug-in: Error: Object file not found on expected location C:\Dokumente und Einstellungen\bklimmek\Eigene Dateien\GLCD_6100_Elektor\default\GLCD_6100.elf Kann damit von Euch jemand was anfangen? Mir eine Lösung liefern
Ich habe mal den Pfad gewechselt, Projektnamen getauscht usw., aber .... gcc plug-in: Error: Object file not found on expected location D:\Verschiedes_eigenes\AVR_Programme\6100_LCD_Elektor\default\6100_LCD_Elektor.elf @Wolfram > Compiliere testweise auf der Kommandozeile. ....mmmmmhhhhhh
-
Thread
DDR-RAM Spartan3E Starterkit nutzen
xst_vlog_bl2cl2/xst_vlog_bl2cl2/par/xst_vlog_bl2cl2.ucf(18)]: NET "infrastructure_top0/sys_clk_ibuf" not found. Please verify that: 1. The specified design element actually exists in the original design. 2. The specified object is spelled correctly in the constraint source file. ERROR:ConstraintSystem
xst_vlog_bl2cl2/xst_vlog_bl2cl2/par/xst_vlog_bl2cl2.ucf(23)]: NET "infrastructure_top0/wait_clk90" not found. Please verify that: 1. The specified design element actually exists in the original design. 2. The specified object is spelled correctly in the constraint source file. ERROR:ConstraintSystem
-
Thread
WinAVR mit Makefile erzeugt Fehler *.elf
Hallo, ich vresuche gerade mit einem vom Makefile erstelltem file, mein Project zu compilieren. Leider funktioniert das nicht so recht. Es kommt ständig die folgende Feherlmeldung: gcc plug-in: Error: Object file not found on expected location C:\testen\speichertest
http://www.mikrocontroller.net/articles/WinAVR#gcc_plug-in:_Error:_Object_file_not_found_on_expected_location
-
Thread
ESP32 - Fehler beim Kompilieren von c't Basecamp mit Asynctcp.h
Arduino\libraries\AsyncTCP-master\src\AsyncTCP.cpp:624:6: error: prototype for 'void AsyncClient::_dns_found(ip_addr_t*)' does not match any in class 'AsyncClient' void AsyncClient::_dns_found(ip_addr_t *ipaddr){ ^ In file included from C:\Users\Andreas\Documents\Arduino\libraries\AsyncTCP-master
::_s_dns_found(const char*, ip_addr_t*, void*)' does not match any in class 'AsyncClient' void AsyncClient::_s_dns_found(const char * name, ip_addr_t * ipaddr, void * arg){ ^ In file included from
-
Thread
Fehlermeldung von WinAVR
habe diese Fehlermeldung nach der Compilierung meines Programmes bekommen: "gcc plug-in: Error: Object file not found on expected location C:\Programme\Atmel\AVR-Programme\Test_1\default\Test_1.elf". Ich weiß nicht was der Compiler macht. Denn ich vermute das er eigentlich den Objektfile erstellen
error sollte doch ein zugriff auf das object file unterbrochen werden, oder!? gruß Benjamin
-
Thread
Spartan3E und SUMP.ORG Logic Analyser Probleme bei der Synthetisierung
: ConstraintSystem:59 - Constraint <NET "an<0>" LOC = "d14" |> [la.ucf(12)]: NET "an<0>" not found. Please verify that: 1. The specified design element actually exists in the original design. 2. The specified object is spelled correctly in the constraint source file. Grüße Wolfgang
site on the device. To bypass this error set the environment variable 'XIL_MAP_LOCWARN'. Error found in mapping process, exiting... Errors found during the mapping phase. Please see map report file for more details. Output files will not be written. Design Summary -------------- Number of
-
Thread
No Rule To Make Target?!
okay, nun habe ich das hier: gcc plug-in: Error: Object file not found on expected location D:\Eigene Dateien\Elektronikzeugs\Projekte\Netzteil\C\Netzteil.elf Make sure your makefile specifies the output .elf file as Netzteil.elf gcc plug-in: Error: Object file not found on expected location D:\Eigene Dateien\Elektronikzeugs\Projekte\Netzteil\C\Netzteil.elf Make sure your makefile specifies the output .elf file as Netzteil.elf Zwei Mal die gleiche
-
Thread
"undefined reference to" mit Makefile
und diese alle im selben Verzeichnis liegen, dann sollte folgendes im makefile stehen: # Target file name (without extension). TARGET = main # Object files directory # To put object files in current directory, use a dot (.), do NOT make # this an empty or blank macro! OBJDIR = .
# Object files directory # To put object files in current directory, use a dot (.), do NOT make # this an empty or blank macro! OBJDIR = ./obj Wobei das alles bei dir ja zu funktionieren scheint
-
Thread
#Include Anfänger Fragen
Settings mein externes Makefile geladen . Aber irgendwas mache ich noch falsch gcc plug-in: Error: Object file not found on expected location C:\Users\sbreuker\Documents\TestC.elf Make sure your makefile specifies the output .elf file as TestC.elf Wahrscheinlich ne Kleinigkeit - aber ich brauche
Mehrzahl der AVR Studio Benutzer dürfte ohne externes Makefile auskommen. > gcc plug-in: Error: Object file not found on expected location > C:\Users\sbreuker\Documents\TestC.elf Kann auch bedeuten, dass die Kompilierung nicht erfolgreich war. AVR Studio hat zusätzliche per Tabellenreiter aktivierbare
-
Thread
.elf Datei plug-in Error??
steht eigentlich in der *.elf Datei. Bei mir kommt immer eine Fehlermeldung: gcc plug-in: Error: Object file not found usw. Ich dachte die Datei wird von selbst angelegt und ich muss mich nicht darum kümmern. Weiß jemand Abhilfe. Vielen Dank im Vorraus Charly
. Hat vielleicht noch jemand einen Tip? hier noch mal die Fehlermeldung : gcc plug-in: Error: Object file not found on expected location D:\project-atmel\LCD ansteuerung\mit_C_11.9.7\default\display.elf mfg Robert
-
Thread
Problem bei LCD Ansteuerung
lcd-routines.h erstellt und in denselben Ordner getan. Jetzt bekomme ich die Meldung: gcc plug-in: Error: Object file not found on expected location J:\Dokumente und Einstellungen\M.Justinger\Desktop\LCD_Test\default\LCD_Test.elf Die Datei gibt es auch nicht, ich weis auch nicht was das für eine Datei ist
erstellt und in denselben Ordner getan. > Jetzt bekomme ich die Meldung: > > gcc plug-in: Error: Object file not found on expected location > J:\Dokumente und > Einstellungen\M.Justinger\Desktop\LCD_Test\default\LCD_Test.elf Punkt 1 Es ist in vielen Fällen unklug, in Dateinamen Dinge wie Leerzeichen
-
Thread
pins.ucf in ISE vs. system.ucf in XPS
ERROR:ConstraintSystem:59 - Constraint <Net "nSYNC" LOC = "T3";> [system.ucf(77)]: NET "nSYNC" not found. Please verify that: 1. The specified design element actually exists in the original design. 2. The specified object is spelled correctly in the constraint source file. ERROR:ConstraintSystem:59 - Constraint <Net "D1" LOC = "R3";> [system.ucf(78)]: NET "D1" not found. Please verify that: 1. The specified design element actually exists in the original design. 2. The specified object is spelled correctly in the constraint source file. usw. Wäre
-
Thread
Compiler Error von WinAVR als Plugin zu AVRStudio
installiert ist auch das neueste WinAVR). Nun bekomme ich leider de Meldung: gcc plug-in: Error: Object file not found on expected location F:\projects\smartLink\firmware\smartLink\default\smartLink.elf natürlich liegt an der besagten Stelle wiklich kein .elf File, aber sollte das nicht der Compiler
http://www.mikrocontroller.net/articles/WinAVR#gcc_plug-in:_Error:_Object_file_not_found_on_expected_location
-
Thread
Wie Linux parasitensicher konfigurieren?
Feh http://ftp.de.debian.org/debian/ testing/main linux-image-4.0.0-2-rt-amd64 amd64 4.0.8-2 404 Not Found Feh http://mirrors.kernel.org/debian/ testing/main linux-image-4.0.0-2-rt-amd64 amd64 4.0.8-2 404 Not Found Feh http://mirrors.kernel.org/debian/ testing/main linux-image-rt-amd64 amd64
passen. Ok, aber es bleibt, mit dem Debian GNU/Linux testing (stretch), noch das Rest-Problem "not found", beim Versuch zu installieren, aber nicht beim search.
-
Thread
Attiny lässt sich nicht flashen
DEVICE ....... The AVR device you compile for # CLOCK ........ Target AVR clock rate in Hertz # OBJECTS ...... The object files created from your source files. This list is # usually the same as the list of source files with suffix ".o". # PROGRAMMER ... Options to avrdude which define
: Version 5.8cvs, compiled on Jan 15 2010 at 17:27:01 ... System wide configuration file is "/usr/local/CrossPack-AVR-20100115/etc/avrdude.conf" User configuration file is "/Users/vinz/.avrduderc" User configuration file does not exist or is not a regular file, skipping
-
Thread
Soundkarte zeitgesteuert "dimmen"
referenced from /var/tmp/Radio.exe could not be loaded: Assembly: Microsoft.VisualBasic (assemblyref_index=1) Version: 10.0.0.0 Public Key: b03f5f7f11d50a3a The assembly was not found in the Global Assembly Cache, a
in the location of the executing assembly (/var/tmp/). ** (Radio.exe:4824): WARNING **: Could not load file or assembly 'Microsoft.VisualBasic, Version=10.0.0.0, Culture=neutral, PublicKeyToken=b03f5f7f11d50a3a' or one of its dependencies. [/code]
-
Thread
init-Problem mit i2c von Fleury
kopiert. Jetzt scheint er sie zu finden. Allerdings kommt jetzt die Meldung: gcc plug-in: Error: Object file not found on expected location D:\i2c\default\i2c.elf Bei meinen bisherigen Programmen habe ich eine solche Meldung nicht bekommen. Allerdings hab ich bisher auch noch keine Programme aus anderen
http://www.mikrocontroller.net/articles/WinAVR#gcc_plug-in:_Error:_Object_file_not_found_on_expected_location
-
Thread
bekomme BlackBoard nicht zum laufen
PartFactory:132 - Working directory /home/jonas/.BlackBoard 17:56:37,506 INFO PartFactory:141 - Found 0 parts. java.io.FileNotFoundException: /home/jonas/.BlackBoard/appWindowConfig.xml (Datei oder Verzeichnis nicht gefunden) at java.io.FileInputStream.open(Native Method) at java.io.FileInputStream
FileNotFoundException: /home/jonas/.BlackBoard/appWindowConfig.xml Errinnere mich noch dunkel... da musste man ein Verzeichniss nach $HOME/.BlackBoard kopieren.
-
Thread
STM32 und Linux - Einsteigerfragen
compiles, we can debug it... --------------------------------- Yes - there are probably quite many files to modify but I do not believe it is that many, if you did that find from the root level of the project, you found all the sources of the HAL libraries which you should be able to just replace as a
99.9%]: PolledQueue.cpp Compile [100.0%]: TaskBase.cpp Link: eth_test Elf2Bin: eth_test Unknown object name found in GCC map file: load address 0x0000000008026ad0 | Module | .text | .data | .bss | |--------------------|----------------|-----------|--------------|
-
Thread
.wav- Dateien mit Visual Basic abspielen
wenn ich dan das zweite Mal etwas in die TextBox eingebe, dann kommt eine Fehlermeldung, das die FileNotFoundExeption nicht behandelt wurde. Wieso klappt das beim ersten Mal, und beim zweiten Mal nicht? Gruß, Steffen
Datei neu anlegen und Text hineinschreiben Private Sub Button1_Click(ByVal sender As System.Object, _ ByVal e As System.EventArgs) Handles Button1.Click Dim FiStr As FileStream = _ New FileStream(TextBox1.Text, FileMode.Create) Dim StrWr As StreamWriter
-
Thread
Namen der Com Schnittstellen in VB auflisten
stehen: 'Dim Device_Name As String = "CP210x USB to UART Bridge Controller" Dim Found_Device As Boolean = False Dim Port As String = "" Dim mos As ManagementObjectSearcher = New ManagementObjectSearcher(queryA) Dim moc As ManagementObjectCollection = mos.Get
Next mos.Dispose() moc.Dispose() GC.Collect() Return "Device Not Found" End Function [/code]
-
Thread
Eagle und Linux
Das hier hat mich zu der Frage gebracht: > not found Die übliche Meldung bei nicht gefundenen Dateien ist 'no such file or directory', ich meinte mich aber dunkel zu erinnern das 'not found' verwendet wird wenn in einem 64bit System die 32bit
eagle$ ./eagle-lin64-7.6.0.run Ensure the following libraries are available: libssl.so.1.0.0 => not found libcrypto.so.1.0.0 => not found /tmp/eagle-setup.5433/eagle-7.6.0/bin/eagle: error while loading shared libraries: libssl.so.1.0.0: cannot open shared object file: No such file or directory
-
Thread
STM32F103 "Blue Pill" USB Bootloader Linux
heavily modified "Default linker script for STM32F10x_512K_64K" Copyright RAISONANCE S.A.S. 2008 found in the STM fw-library. (there is not much left from Raisonance's code and nearly everything has been modified or reordered) */ /* Program Entry, set to mark it as "used" and avoid gc */ ENTRY
Stack_Init = _estack - __Stack_Size ; /*"PROVIDE" allows to easily override these values from an object file or the commmand line.*/ PROVIDE ( _Stack_Init = __Stack_Init ) ; [/c] Was müsste ich jetzt da ändern um mit dem USB-Bootloader klarzukommen? Grüße, Martin
-
Thread
16-Bit-EXE erzeugen
virtuelle Maschine aufzusetzen. Auf einer 16-Bit-Maschine soll einfach der Text: "Error - could not run application - Media data not found)" über stdout oder stderr (ist tatsächlich egal) ausgegeben und der Rückgabewert 1 erzeugt werden.
mov r0, #1 mov r7, #__NR_exit svc #0 .size _start, .-_start .type message, %object message: .ascii "Error - could not run application - Media data not found)!\r\n" message_end = . .size message, message_end-message[/code] Im Anhang das Kompilat als ELF.
-
Thread
Thermomix Rezeptchips
Any idea how the recipe key is being encrypted ? Cryptsetup does not recognize the file: # cryptsetup luksDump recipes.img Device recipes.img is not a valid LUKS device.
loop). Using that kernel image in qemu failed (no surprise because Vorwerk documented that it would not work when compiled with gcc5 and I did not have a gcc4.4 at hand). Another interesting point - but maybe concerning too - I found in the .bb file is that they have a series of sed commands to inject
-
Thread
xc3sprog compilieren
module 'libftd2xx' -- Package libftd2xx was not found in the pkg-config search path. Perhaps you should add the directory containing `libftd2xx.pc' to the PKG_CONFIG_PATH environment variable Package 'libftd2xx', required by 'world', not found -- Could NOT find LIBFTD2XX (missing: LIBFTD2XX_INCLUDE_DIR) -- Checking for module 'libusb' -- Found libusb, version 0.1.12 -- Found LIBUSB: /usr/lib/x86_64-linux-gnu/libusb.so -- Configuring done --
-
Thread
Alles Rund um den MEDION LIFE P89626 NAS
}" >> ${log_file} ${script_path} >> ${log_file} else echo "File ${script_path} not found!" >> ${log_file} fi done fi [/code] Der Inhalt von /i-data/6764ac2f/admin
remount-ro) ~ # cd /mnt/parnerkey /mnt/parnerkey # chmod a+x ./xfs* chmod: ./xfs_growfs: Read-only file system chmod: ./xfs_repair: Read-only file system /mnt/parnerkey # xfs_repair -n /dev/sda2 -sh: xfs_repair: not found /mnt/parnerkey # xfs_repair -sh: xfs_repair: not found /mnt/parnerkey # ls-al
-
Thread
elf problem ich krieg die krise
gleich erst ma kompiliert aber siehe da es kommt folgende fehlermeldung: gcc plug-in: Error: Object file not found on expected location T:\ELEKTRONIK\..dmx\default\testlauf.elf Da kam natürlich schon mal freude auf. :-) Aber es kommt noch besser.... Hab nen komplett neues Projekt als Test angelegt
return 0; } Und was kommt?? LOL die selbe Fehlermeldung noch einmal... gcc plug-in: Error: Object file not found on expected location T:\ELEKTRONIK\..dmx\default\testlauf.elf Aber woran liegt das bitte schön?? Kann mir das jemand erklären seit gestern habe ich nichts mehr daran gemacht auch
-
Thread
VS zeigt seltsames Verhalten auf unterschiedlichen Maschinen
commandLine) bei xxx.My.MyApplication.Main(String[] Args) in : Zeile83 Innere Ausnahme 1: FileNotFoundException: Die Datei oder Assembly "System.Data.Common, Version=5.0.0.0, Culture=neutral, PublicKeyToken=b03f5f7f11d50a3a" oder eine Abhängigkeit davon wurde nicht gefunden. Das System kann die
Zeilen, die wirklich was aussagen sind diese: > Innere Ausnahme 1: > FileNotFoundException: Die Datei oder Assembly "System.Data.Common, > Version=5.0.0.0, Culture=neutral, PublicKeyToken=b03f5f7f11d50a3a" oder > eine Abhängigkeit davon wurde nicht gefunden. Das System
-
Thread
Eclipse und WinAVR
Path liegt? Ich bekomm jetzt immer Warnings wie z.B.: C/C++ Indexer Problem: Preprocessor Inclusion not found: avr/io.h in file: ... Bei Standard Make C Projects konnte man den Include Path direkt in den Project Properties angeben, bei Managed Make existiert dieser Punkt nich ...
Fehler ausgegeben wurden. Jetzt bekomme ich noch folgenden Fehler: Generating Extended Listing-File Usage: c:\WinAVR\bin\avr-objdump.exe <option(s)> <file(s)> Display information from object <file(s)>. At least one of the following switches must be given: Dann werden die ganzen Optionen aufgezählt