-
Thread
Tiny2313 Probleme beim Compilen
Message: gcc plug-in: make() Target successfully built gcc plug-in: PlugInUtility::getExternalHeaderFiles Dependency directory does not exist (F7) Build: Build started 9.11.2008 at 12:55:23 make: Interrupt/Exception caught (code = 0xc00000fd, addr = 0x4217b3) Build succeeded with 0 Warnings... Message: gcc plug-in: Error: Object file not found on expected location C:\Users\Tollerteppich\Desktop\AVR-Studio\Servotester\default\Servotester.elf gcc plug-in: PlugInUtility::getExternalHeaderFiles Dependency directory does not exist
-
Thread
OLE Server Altium
dass ich im Altium 19 kein Logo einfügen kann für den Top Overlay. Ich versuchte es über Place-> object form file-> und dan ein monochrom BMP ausgewählt. Was aber dan kommt ist lediglich eine Fehlermeldung: Supported OLE Server was not found for file. Was ist dabei genau das problem? Und wie kann ich
Versuche das Bild in ein DXF zu wandeln und importiere das in dein PCB file.
-
Thread
VB2005-DLL einbinden
Card " + Str(h) + " connected" Case -1 Label1.Text = "Card " + Str(CardAddress) + " not found" End Select End Sub Private Sub Form_Terminate() CloseDevice() End Sub Private Sub Button1_Click(ByVal sender As System.Object, ByVal e As System.EventArgs) Handles Connect.Click
application is terminated End Sub 'Private Sub Button1_Click(ByVal sender As System.Object, ByVal e As System.EventArgs) ' Connect_Click() 'End Sub Private Sub OpenScriptButton_Click(ByVal sender As System.Object, ByVal e As System.EventArgs) Handles OpenScriptButton.Click
-
Thread
Komischer Fehler, wenn die Optimierung auf O0 gestellt wird
defined here make: *** [AVRDebug.elf] Error 1 und 16-Dec-2007 16:44:50 gcc plug-in: Error: Object file not found on expected location E:\Project\PIC Programmer MCU SW\AVRDebug\default\AVRDebug.elf . Ich habe jetzt herausgefunden, dass der Fehler nur auftritt, wenn ich die sin() Funktion verwende
: AmadeusTraceAVR.h: No such file or directory main.c:6: warning: function declaration isn't a prototype main.c: In function 'main': main.c:8: warning: implicit declaration of function 'ATInit' main.c:12: warning: implicit declaration
-
Thread
GNU ARM Linker Problem, LPC3250 Code soll auf HITEX USB Stick auf RAM ausgeführt werden
lpc") SEARCH_DIR( ".\Lib\csps\lpc32xx") /******************************************* Define Files *******************************************/ INPUT ( $(LinkObjects) ) INPUT (lpc.a lpc32.a) /* Define the supported output formats - elf32-littlearm is the default */ OUTPUT_FORMAT("elf32
__asm("service_mic:"); __asm("CMP r3, #0"); __asm("BNE int_found"); /* The interrupt was not from MIC */ __asm("service_sic1:"); /* Read the SIC1 interrupt status registers */ __asm("LDR r2, =SIC1_BASE_ADDR "); __asm("LDR r3,
-
Thread
Fehler AVR Studio
ich hab ein problem und zwar bringt mein AVR-Studio folgende Fehlermeldung: "gcc plug-in:Error: Object file not found on expected location C:\Dokumente und Einstellungen\tom\Eigene Dateien\test10\default\test10.elf" ich hab keine ahnung was auf einmal los ist... bei allen anderen Testversion (1 bis
Vielleicht wurde der Kompilierversuch nicht zu Ende geführt und es gibt einfach kein elf-File? Gab es Fehlermeldungen beim Kompilieren?
-
Thread
c# mp4 player
Form1() { InitializeComponent(); } private void Form1_Load(object sender, EventArgs e) { } private void button1_Click(object sender, EventArgs e) { wmPlayer = new AxWMPLib.AxWindowsMediaPlayer(); wmPlayer.CreateControl
wmPlayer.Ctlcontrols.play(); } } } [/c] Fehlermeldung ist bei Abruf von button1: System.IO.FileNotFoundException: "Die Datei oder Assembly "Interop.WMPLib, Version=1.0.0.0, Culture=neutral, PublicKeyToken=null" oder eine Abhängigkeit davon wurde nicht gefunden. Das System kann die angegebene Datei
-
Thread
Mega16 & S65 Disaply "HelloWorld"-Test merkwürdige Fehlermeldung
Okay, habe ich getan. Nun meckert er, dass er das .elf-File nicht findet. gcc plug-in: Error: Object file not found on expected location E:\Elektronik-Projekte\ATMEL\S65_Grafikdispl\default\S65_Grafikdispl.elf Unter Build steht nun: ../lcd.s:58: Error:
-
Thread
Inline ASM: exakte Verzögerung
) required make: *** [prg.o] Error 1 Build succeeded with 0 Warnings... gcc plug-in: Error: Object file not found on expected location D:\Programmierung\Prg\default\Prg.elf Ich bin über Hinweise, wie ich meinen Fehler korrigieren kann oder meinen Zähler verbessern kann, dankbar :-) Gruß
delay time must be an expression that is a known constant at compile-time. If these requirements are not met, the resulting delay will be much longer (and basically unpredictable), and applications that otherwise do not use floating-point calculations will experience severe code bloat by the floating-point
-
Thread
Clock Domain Crossing - Timing Constraints - set-false-path
über ein nichteinhalten der Timing Constraints der Datenvektoren. Daher wollte ich nun in die UCF-File den "set-false-path"-Parameter für die langen Vektoren setzten. Leider will es mir einfach nicht gelingen. Ich scheine sowohl Fehler im Syntax als auch in der richtigen Bezeichnung der Signale/Signalpfade
ch_count_ch2/CLOCKCOUNT_0_SAVE" TIG;> [ONE4ALL.ucf(10)]: NET "f_read_md/ch_count_ch2/CLOCKCOUNT_0_SAVE" not found. Please verify that: 1. The specified design element actually exists in the original design. 2. The specified object is spelled correctly in the constraint source file. ----- Die
-
Thread
Headerdatei der main lässt sich nich includen
. wenn ich jetzt aber die gps.h in der mmc.h includen will, sagt er mir: gcc plug-in: Error: Object file not found on expected location D:\Projekte\GPS\GPS.elf Make sure your makefile specifies the output .elf file as GPS.elf wenn ich die GPS.h in der mmc.h nicht include, funktioniert das compilen
-
Thread
CP/M auf ATmega88
define\"ID {print $3}" config.inc, ...) failed. [/code] - es wird keine eep-Datei erzeugt, im MakeFile steht aber für "make program" sowohl hex als auch eep brennen. Daher kommt es zum Fehler "avrcpm.eep not found". Ist das schlimm? Wird überhaupt was ins eeprom geschrieben? Wenn ich den 328er dann
Marcel A. schrieb im Beitrag #3880111: > im MakeFile steht aber für "make > program" sowohl hex als auch eep brennen. Daher kommt es zum Fehler > "avrcpm.eep not found". $ make flash make program benutzt kein Mensch (dachte ich) > Ist das
-
Thread
Python SCPI - Keithley DMM6500 u.ä.
sagt dazu: _single_leading_underscore: weak “internal use” indicator. E.g. from M import does not import objects whose names start with an underscore Außerdem werden solche Variablen nicht in die Dokumentation (.__doc__) der Klasse und ihrer Instanzen aufgenommen. Sie sind also nicht "private
mytuple = (1, 2, 3) >>> mytuple (1, 2, 3) >>> mytuple[1] = 5 Traceback (most recent call last): File "<stdin>", line 1, in <module> TypeError: 'tuple' object does not support item assignment >>> mytuple (1, 2, 3) [/pre] Auch Methoden wie list.append() etc. kennen Tupel nicht. Daraus ergibt sich
-
Thread
Problem mit WampServer und Https
VERSION_APACHE} ServerRoot "${APACHE_DIR}" # # Mutex: Allows you to set the mutex mechanism and mutex file directory # for individual mutexes, or change the global defaults # # Uncomment and change the directory if mutexes are file-based and the default # mutex file directory is not on a local disk or
and .htpasswd files from being # viewed by Web clients. # <Files ".ht*"> Require all denied </Files> # # ErrorLog: The location of the error log file. # If you do not specify an ErrorLog directive within
-
Thread
Fehlermeldung gcc-plugin:error ...
Hi, ich habe meinen Sourcecode in verschiedene Files *.c und *.h aufgeteilt. Die Header-dateien werden entsprechend in der main.h eingebunden. Soweit funktioniert es auch einwandfrei. Versuche ich jedoch in irgendeiner der anderen (nicht main.h) Header-Dateien Variablen anzulegen, kommt folgende Fehlermeldung: gcc plug-in: Error: Object file not found on expected location Y:\Projekte\g800016_Dispenser\uC_Software\80016_Dispenser_v_0_1_0\default\80016_Dispenser.elf Als Beispiel habe ich ein Projekt in den Anhang gepackt. Der Fehlerteufel
-
Thread
Fehlermeldung beim Compilieren
plugin STK500 Loaded plugin AVR GCC Loaded partfile: C:\Programme\Atmel\AVR Tools\PartDescriptionFiles\ATtiny45.xml gcc plug-in: Error: Object file not found on expected location I:\probe\default\probe.elf ich habe gegooglt und die Lösungwege nachgegangen aber ich kamm zu keinem Ergebnis. Weiss
-
Thread
MIG: DDR2 an Spartan-3AN
example_design/par/compatible_ucf/xc3s700a_fg484.ucf(667)]: INST "main_00/top0/controller0/rst_dqs_div_r" not found. Please verify that: 1. The specified design element actually exists in the original design. 2. The specified object is spelled correctly in the constraint source file.[/code] häufen
rst_dqs_div_r Möglicherweise hast Du Deine Instanziierung umbenannt, so daß sie nicht mehr zum .ucf-File passt. Duke
-
Thread
Sicherheitsvorteil durch Linux?
cc782258%28v=ws.10%29.aspx "When a hotpatch package is installed, it: - Replaces the old binary file on disk with the coldpatch binary file. - Injects the updated function (as a hotpatch binary file) into the loaded image of the defective binary file..." das gab mit Windows Server 2003 und wurde vor
dürfen nicht einfach > vergessen werden, sonst werden wir linux bald nichtmehr wiedererkennen. Zur Not bleiben noch einige BSDs...
-
Thread
Pascal Compiler für PIC - ist wirklich Freeware
when i see, that someone only spoken "C" and now beleave, this ist the World. I hope, my text are not so bad. oldmax
old-fashioned. I decided not to argue anymore in a forun about pros and cons of any programming language, because it's wasting of time. An Internet Forum is the worst place and way of discussing fundamentals which are not question-like
-
Thread
800 MHz-RP2350, Unterwasser-Sondierdrohnen, Audioforensik und Lieferzeiterhöhungen
Windows 11 und zweitens auf die Suche nach einem Distributor bzw Weiter-Pfleger hinweisen: [c] Note: NEC5 is no longer being maintained or supported. Windows 10 is the last version of Windows in which the NEC5 GUI can run. The GUI is not compatible with Windows 11. . . . LLNL continues to seek
Tam H. schrieb im Beitrag #8014326: > I found that CoreMark actually gave a slightly higher performance per > MHz using the RISC-V cores - just under 5% faster. Das ist überraschend; wird nicht ständig überall damit herumgetönt, wie langsam
-
Thread
Linker Error
failed with 3 errors and 0 warnings... Wenn ich nach dem Übersetzen mit den Fehlermeldungen das File dann programmiere tuts. Vielleicht weiss ja jemand Rat! gruß tom
Exit-Code zu verwenden? Windows-Programmierer zu sein? Keine Ahnung, die berüchtigte Meldung ``Object file not found in expected location'' hängt ja auch damit zusammen, und ich habe schon vor einiger Zeit einen Bugreport dafür aufgemacht. Irgendwie muss man die Fehlermeldungen natürlich schon
-
Thread
EleLa - Elektronik Lagerverwaltung V3.1
I try to change scale factor in ini file, scale is changed, but overlap not changed. My os is Ubuntu 20.04.
Here the files for EleLa V4.0 english and russia. But the translation is now not complete, the most texts are translated.
-
Thread
Probleme mit CC900 von CipherLab
dieser selbst) es meine C-Datei und es kommt dann die Fehlermeldung "cc900-Fatal-100 : No source file found in invocation", ja das war mir schon klar wenn die Datei fehlt. Datei wieder ins Verzeichnis kopiert und Compiler noch einmal ausgeführt meldet es sich mit folgender Meldung: "cc900-Fatal-116
mich gerade darin den gcc-arm zu nutzen und hoffe innigst das es irgendwie funktioniert und ich die object-files dann wiederum mit dem Linker linken und mit dem Converter in das Motorola-Format transformieren kann. Grüße Christian
-
Thread
EEPROM AVR Studio - nicht möglich?
plugin STK500 Loaded plugin AVR GCC Loaded partfile: C:\Programme\Atmel\AVR Tools\PartDescriptionFiles\ATmega64.xml gcc plug-in: Output directory D:\Eigene Dateien\Benutzer\Jens\Quellcode\BC3000\IO\V1\default\ does not exist gcc plug-in: Created directory D:\Eigene Dateien\Benutzer\Jens\Quellcode\BC3000\IO\V1\default\ gcc plug-in: Error: Object file not found on expected location D:\Eigene Dateien\Benutzer\Jens\Quellcode\BC3000\IO\V1\default\BC3000IO.elf aber wieso? Früher hats mal genau so funktioniert ... achso und scheinbar hängt
-
Thread
Migration c++ Projekt SLES11 nach RHEL7.2
include <vector> ==> #include <bits/stl_algobase.h> ==> #include <bits/c++config.h> //<< not found [/code] Ich vermute einen Fehler in der Installation, weil ich kann mir nicht vorstellen, dass der c++ Compiler nicht konsistent ist. Hat jemand evtl. einen Tipp? Grüsse, René
3.1.02/06_Deployment/binaries' /usr/bin/cmake -E cmake_progress_report /home/user/Proj/binaries/CMakeFiles 1 [ 1%] Building CXX object CMakeFiles/proj.dir/projmain.cpp.o /usr/bin/c++ -D_REENTRANT -Weffc++ -Wall -Wextra -Wno-long-long -fno-strict-aliasing -O2 -I/home/user/Proj/binaries/../../04_Implementation
-
Thread
Willtek Schlumberger Stabilock 4031 4032
messages to narrow down the defect module. As Mike wrote the faulty module displayed is usually not the defective module. Most errors in such modules are VCOs that are not working or with false frequency. Look for corroded traces or vias round the capacitors. Markus
on my 4031 that I purchased used. Everything seems to work but I have no picture. Monitor neck does not even light up at all. PSU voltages were checked and they are all good. I found a resistor on the green wire going to the neck of the crt. It was completely burnt and cracked in half. The schematic
-
Thread
String einlesen und bearbeiten
] Sowas spart RAM ;) Siehe hierzu auch: http://www.avrfreaks.net/index.php?name=PNphpBB2&file=viewtopic&t=38003
ich habe diesen befehl jetzt eingefügt aber dann sagt er mir folgendes: gcc plug-in: Error: Object file not found on expected location K:\AVR\AVR-Programme\Wechselrichter Störmeldeprogramm\default\WvS-Sample.elf und wenn ich eine WvS-Sample.elf datei einfüge löscht er sie mir wieder. was kann
-
Thread
AT32UC3 + EVK1100: wie bekomme ich den DFU-Bootloader da wieder rein?
nicht. Aber aus "avrfreaks.net": Well you could either program: - using AVR Studio 5 to program (file-> new -> debug an object file or similar) - or if you feel like a warrior, install AVR32 Studio 2.6 or the GNU toolchain 2.4.2 (eg can be found here http://dl.stackfoundry.org/hardware/cop ... etup.exe
gelöscht. Wie bekomme ich den DFU-Bootlader wieder mit dem JTAGICE3 wieder rein. Wo gibt es das Hex-File?
-
Thread
StartupProblem mit WinAvr , Gcc
jetzt ein Build & Run ausfuehre bekomme ich die folgende Fehlermeldung: gcc plug-in: Error: Object file not found on expected location ....\default\Test.elf Die Datei existerit auch nicht von daher ist es also kein wunder. Aber normalerweise muesste die Datei doch von alleine angelegt werden. Hat jemand eine Ahung wie man das ganze beheben koennte ? Ist es vielleicht ein Make File problem ?
-
Thread
Welche 32-Bit uC-Familie ist empfehlenswert?
setuid-root?[/pre] Wenn xclm ein Link auf /bin/true ist, bekommt man immer noch object files, nur die Fehlermeldungen werden etwas abschreckender [pre]lcd-cg.c cc1: warning: Detected corrupt executable file cc1: note: Please reinstall the compiler In file included from lcd-cg.c:4:
p0' [-Wpadded] uint16_t p0; ^~ cc1: warning: Detected corrupt executable file cc1: note: Please reinstall the compiler[/pre]
-
Thread
FT800 / FT810 Library
appears regarding the SPI library. This is a "feature" of Arduino that for "reasons" the classes are not supposed to work with plain .c files. It should work just fine if you rename "EVE_commands.c" to "EVE_commands.cpp". There might be a solution to fix that without renaming the file but I have not found one yet and I am normally not reminded about this since I am normally not using the Arduino framework. Plus that renaming the file works kind of tells me that the issue is not really on my side.
-
Thread
[VHDL] Daten von ADC in BRAM speichern
>>I:/FPGA/tb_sampler.vhd(129): Illegal type conversion to std.standard.integer >>(operand type is not known). >>># ** Error: >>I:/FPGA/tb_sampler.vhd(129): Type conversion (to std_logic_vector) can not >>have aggregate operand. >>># ** Error: >>I:/FPGA/tb_sampler.vhd(200): VHDL Compiler exiting
Diese Meldung finde ich schon komisch: >>>Found inferred clock PLL_MODUL_50Mhz_1|CLKOS_inferred_clock with period >>>10.00ns. A user-defined clock should be declared on object >>>"n:System_Clock.CLKOS" Vor allem da sie in der PLL vorkommt und da
-
Thread
Problem mit inline Funktionen
auch kein guter Stil (oder??). Ich hätte auch gedacht ich könnte inline Fkt. direkt in der Header-File definieren allerdings bekomm ich dann immer den Fehler: gcc plug-in: Error: Object file not found on expected location [..] Bin für jeden Tipp dankbar! so long ... Lif
-
Thread
Programm für PC ohne Betriebssystem
OFFSET TEXTTAB ; Offset auf Text SUCH: cmp al, [si] ; Taste suchen jz FOUND ; gefunden ? lea si, [si+1] dec cx jnz SUCH jmp NOKEY FOUND: XFOUND: NOKEY: jmp MAIN ; ..............
esi, [esi+10h] cmp esi, ebp ; Ende erreicht ? jb OBJECT2 mov esi, DWORD PTR[MAUKA1] ; Zeiger auf Sprite-Tabelle mov ebp, DWORD PTR[MAUHI1] ; Tabellen-Ende OBJECT3: mov edi, [esi] ; Adresse aus Tabelle
-
Thread
Eagle 5.10 unter mate 17: libjpeg.so.62 nicht gefunden - woher nehmen?
libjpeg.so.62: [pre] error while loading shared libraries: libjpeg.so.62: cannot open shared object file: No such file or directory [/pre] Ich habe libjpeg62 installiert, aber das ist nur die 64-Bit-Version, während der Eagle offenbar 32 Bit ist. Wo kann man die 32-Bit libjpeg62 her bekommen
nachgesehen, was fehlt. Also z.B. "ldd /opt/eagle/version/bin/eagle", dann steht da bei libjpeg "not found". So kannst du gleich nachsehen, was noch fehlt. //edit3: packages.debian.org - dort das Package suchen - dann die Debian-Version wählen - lib finden. ABER bitte installiere keine zu deiner
-
Thread
Installation von AVRSTUDIO 4.19 bricht unter WIN10 ab
properly before you install a new version. If you have modified any of the AVR Studio 4 installed files, they may not be overwritten/upgraded if a newer version is installed. Then make sure you uninstall before installing a new version. We recommend that the latest version of MS Internet Explorer is installed. We require its library functions because of extensive use of XML file parsing within AVR Studio 4. Unexpected behaviour may occur if this is not installed. It is important that you have all the latest service packs installed on your OS. Some installation problems may
-
Thread
Sammelbestellung USBTMC Adapter. Interesse?
subprocess.py", line 1550, in _execute_child hp, ht, pid, tid = _winapi.CreateProcess(executable, args, FileNotFoundError: [WinError 2] Das System kann die angegebene Datei nicht finden [/code] Vielleicht kann jemand helfen? Gruss Chregu
twilightlogic repo) und getestet! Joachim B. schrieb im Beitrag #7831348: > 2x auf eine Seite 404 not found. Welche Seiten bitte? Ich habe geschaut und nichts gefunden. 73
-
Thread
AVR Studio - *.elf Problem mit Funktionen
Der Compiler des Studio's gibt mir im Message-Fenster die Meldung aus: [pre]gcc plug-in: Error: Object file not found on expected location C:\Dokumente und Einstellungen\jh\Eigene Dateien\atmega128_code_samples\main\default\main.elf [/pre] Das Build-Fenster meldet: [pre] rm -rf main.o function.o
benötigten .c-Dateien angeben. Damit funktioniert das dann auch mit make ohne includieren von .c-Files. .h-Dateien müssen im übrigen immer includiert werden, in jedem !! .c-File. Das geht nicht "automatisch". Viel Erfolg Oliver
-
Thread
Spartan 3e 1600 + DDR - SDRAM + MIG 3.0
Direkt als Referenz Design für das gleiche Board jedoch mit Spartan-3E 500E... Das einbinden der Files in Ise Webpack klappt auch noch hervorragend. Jedoch bekomme ich beim "Implement Design - Translate" - Schritt folgende fehlermeldungen... ERROR:ConstraintSystem:59 - Constraint <INST "main_00/
585)]: INST "main_00/top0/data_path0/data_read_controller0/gen_wr_en[1].fifo_1_wr_en_inst " not found. Please verify that: 1. The specified design element actually exists in the original design. 2. The specified object is spelled correctly in the constraint source file. Da es sich
-
Thread
AVR Studio mal wieder
compiliert und simuliert habe, bekomme ich auf einmal die nächste Fehlermeldung: "gcc plug-in: Error: Object file not found on expected location E:\Work\ATmel\LCD\default\LCD.elf" An was kann das liegen und was muss ich einstellen, dass es wieder ok ist?? Gruß
-
Thread
Programmer incl. neuem Code für Atmel AN910
################################## | 100% 0.00s avrdude: Device signature = 0x01911e avrdude: NOTE: FLASH memory has been specified, an erase cycle will be performed To disable this feature, specify the -D option. avrdude: erasing chip avrdude: reading input file "lwa_mq.hex" avrdude: input file lwa_mq.hex auto detected as Intel Hex avrdude: writing flash (1832 bytes): Writing | | 0% 0.00savrdude: error: programmer did not respond to command
-
Thread
Libusb usb_bulk_read "echtzeitfähig"?
define EP_OUT 0x02 //in Firmware definiert #define BUF_SIZE 64*16 #define BUF_IN_SIZE 64*8 FILE *datei; static char wert[BUF_SIZE]; static char *pread=wert; static char *pwrite=wert; static char *start=wert; int byteread=0; int bytewritten=0; int durch1=0; float durch2=0; int
find all connected devices */ if(!(fd_dev = open())) { printf("Error: device not found!\r\n"); return(false); } if(usb_set_configuration(fd_dev, 1) < 0) { printf("Error: setting config 0 failed\n"); printf("Error: %s\r\n", usb_strerror()); usb_close
-
Thread
Spartan 3AN Constraints Problem
[code] ERROR:ConstraintSystem:59 - Constraint <PULLDOWN ;> [s3astarter.ucf(27)]: NET "BTN_SOUTH" not found. Please verify that: 1. The specified design element actually exists in the original design. 2. The specified object is spelled correctly in the constraint source file. [/code] Jetzt
der lautet genau: [code] ERROR:HDLParsers:802 - "/ichBinEinPfad/eq.vhd" Line 14. BTN_SOUTH is not a boolean expression. ERROR:HDLParsers:826 - "/idhBinEinPfad/eq.vhd" Line 14. When condition BTN_SOUTH is not of type BOOLEAN. [/code] MfG André
-
Thread
Embedded Linux Kernel debuggen
.bss : 0xa001c740 - 0xa004370c ( 156 kB) SLUB: Genslabs=13, HWalign=32, Order=0-3, MinObjects=0, CPUs=1, Nodes=1 NR_IRQS:16 nr_irqs:16 16 OF: no ranges; cannot translate System timer is /soc/timer@E0004000 OF: no ranges; cannot translate Kernel panic - not syncing: Can't remap registers
0x01; FIO2DIR |= 1;*/ } } while(node != NULL); /* check whether a node was found */ if(node == NULL) { panic("No system timer found"); } } [/C] Testen konnte ich es noch nicht, aber es erscheint mir nun alles relativ plausibel. Was ich damit machen will - im
-
Thread
[Atmega8]LCD-Display+UART
bei der ich nicht weiß wie ich sie beheben soll! Weiß es einer von euch ? gcc plug-in: Error: Object file not found on expected location C:\Documents and Settings\Administrator\Desktop\LCD_Total\default\LCD_Total.elf c:/winavr-20080610/lib/gcc/../../avr/include/util/delay.h:90:3: warning: #warning
-
Thread
zugriff auf AVR -SRAM in ASM und C
Dank an euch beide! Jetz bekomme ich allerdings dauernd die Fehlermeldung: gcc plug-in: Error: Object file not found on expected location C:\Dokumente und Einstellungen\......\dmx_asm_c_test.elf Irgendwie mag das AVR-Studio 4.14 mein Assembler-file nicht. Es ist mein erstes Projekt in dem ich
-
Thread
Erweiterbares Ethernetboard mit MMC/SD-Slot und USB
aufgerufen und die TCP-Verbindung geschlossen. Für ein Beispiel schau Dir auch mal httpd_module_file_callback() an. Hier werden die Dateien der Speicherkarte stückweise rausgeschickt. Gruß, Roland
Das AVR-Studio mag aber mit dem makefile nicht richtig umgehen und wirft die bekannte Meldung "Object file not found on expected location". Deswegen habe ich ein Projektfile fürs Studio und einen Patch angehängt, evtl. hilft das dem einen oder anderen. Die richtigen Einstellungen fürs XMEM waren
-
Thread
WordClock mit WS2812
File "serial\serialutil.pyo", line 282, in __init__ File "serial\serialwin32.pyo", line 66, in open SerialException: could not open port 'COM7': WindowsError(5, 'Zugriff verweigert') [/code]
Nucleo powered laptop (still not done as it is described on the website) is not cut. ESP powered by a separate power supply does not work (weight combined with Nucleo)
-
Thread
C++ DLL in Labview einbinden
DLL 1 ist das unterste Schicht in VStudio dann DLL2 ist der zweite Schicht dann meine Main_Object "GUI", wo ich die beide DLL 1 und DLL 2 aufrufe. beide DLL File sind in der C++ ale eigene Projeckt
warum nicht die Add Funktion weiss es nicht. das ist auch den Report, die ich dazu bekomme: VI Not Executable The VI is not executable because of one of the following reasons: 1. The shared library or a dependent file is not installed. To make the VI executable, you must install the shared library
-
Thread
Fehler bei der Bibliothekinitialisierung in Keil 5
beheben könnte? Die Fehlermeldung lautet "fatal error in include chain (stm32f407xx.h):'core_cm4.h' file not found" Software Pack für STM32F407VGTx habe ich schon mit dem Pack Installer aufgespielt. (Siehe Anhang) Paths sind eigentlich auch alle initialisiert.(Siehe Anhang) PS: Das Einzig was
Fehlermeldungen und Warnungen: "Program Size: Code=684 RO-data=408 RW-data=0 ZI-data=1632 ".\Objects\Beispiel1.axf" - 0 Error(s), 0 Warning(s). Build Time Elapsed: 00:00:21"