-
Thread
Eagle 5.10 unter mate 17: libjpeg.so.62 nicht gefunden - woher nehmen?
libjpeg.so.62: [pre] error while loading shared libraries: libjpeg.so.62: cannot open shared object file: No such file or directory [/pre] Ich habe libjpeg62 installiert, aber das ist nur die 64-Bit-Version, während der Eagle offenbar 32 Bit ist. Wo kann man die 32-Bit libjpeg62 her bekommen
nachgesehen, was fehlt. Also z.B. "ldd /opt/eagle/version/bin/eagle", dann steht da bei libjpeg "not found". So kannst du gleich nachsehen, was noch fehlt. //edit3: packages.debian.org - dort das Package suchen - dann die Debian-Version wählen - lib finden. ABER bitte installiere keine zu deiner
-
Thread
Installation von AVRSTUDIO 4.19 bricht unter WIN10 ab
properly before you install a new version. If you have modified any of the AVR Studio 4 installed files, they may not be overwritten/upgraded if a newer version is installed. Then make sure you uninstall before installing a new version. We recommend that the latest version of MS Internet Explorer is installed. We require its library functions because of extensive use of XML file parsing within AVR Studio 4. Unexpected behaviour may occur if this is not installed. It is important that you have all the latest service packs installed on your OS. Some installation problems may
-
Thread
Sammelbestellung USBTMC Adapter. Interesse?
subprocess.py", line 1550, in _execute_child hp, ht, pid, tid = _winapi.CreateProcess(executable, args, FileNotFoundError: [WinError 2] Das System kann die angegebene Datei nicht finden [/code] Vielleicht kann jemand helfen? Gruss Chregu
twilightlogic repo) und getestet! Joachim B. schrieb im Beitrag #7831348: > 2x auf eine Seite 404 not found. Welche Seiten bitte? Ich habe geschaut und nichts gefunden. 73
-
Thread
AVR Studio - *.elf Problem mit Funktionen
Der Compiler des Studio's gibt mir im Message-Fenster die Meldung aus: [pre]gcc plug-in: Error: Object file not found on expected location C:\Dokumente und Einstellungen\jh\Eigene Dateien\atmega128_code_samples\main\default\main.elf [/pre] Das Build-Fenster meldet: [pre] rm -rf main.o function.o
benötigten .c-Dateien angeben. Damit funktioniert das dann auch mit make ohne includieren von .c-Files. .h-Dateien müssen im übrigen immer includiert werden, in jedem !! .c-File. Das geht nicht "automatisch". Viel Erfolg Oliver
-
Thread
Spartan 3e 1600 + DDR - SDRAM + MIG 3.0
Direkt als Referenz Design für das gleiche Board jedoch mit Spartan-3E 500E... Das einbinden der Files in Ise Webpack klappt auch noch hervorragend. Jedoch bekomme ich beim "Implement Design - Translate" - Schritt folgende fehlermeldungen... ERROR:ConstraintSystem:59 - Constraint <INST "main_00/
585)]: INST "main_00/top0/data_path0/data_read_controller0/gen_wr_en[1].fifo_1_wr_en_inst " not found. Please verify that: 1. The specified design element actually exists in the original design. 2. The specified object is spelled correctly in the constraint source file. Da es sich
-
Thread
AVR Studio mal wieder
compiliert und simuliert habe, bekomme ich auf einmal die nächste Fehlermeldung: "gcc plug-in: Error: Object file not found on expected location E:\Work\ATmel\LCD\default\LCD.elf" An was kann das liegen und was muss ich einstellen, dass es wieder ok ist?? Gruß
-
Thread
Programmer incl. neuem Code für Atmel AN910
################################## | 100% 0.00s avrdude: Device signature = 0x01911e avrdude: NOTE: FLASH memory has been specified, an erase cycle will be performed To disable this feature, specify the -D option. avrdude: erasing chip avrdude: reading input file "lwa_mq.hex" avrdude: input file lwa_mq.hex auto detected as Intel Hex avrdude: writing flash (1832 bytes): Writing | | 0% 0.00savrdude: error: programmer did not respond to command
-
Thread
Libusb usb_bulk_read "echtzeitfähig"?
define EP_OUT 0x02 //in Firmware definiert #define BUF_SIZE 64*16 #define BUF_IN_SIZE 64*8 FILE *datei; static char wert[BUF_SIZE]; static char *pread=wert; static char *pwrite=wert; static char *start=wert; int byteread=0; int bytewritten=0; int durch1=0; float durch2=0; int
find all connected devices */ if(!(fd_dev = open())) { printf("Error: device not found!\r\n"); return(false); } if(usb_set_configuration(fd_dev, 1) < 0) { printf("Error: setting config 0 failed\n"); printf("Error: %s\r\n", usb_strerror()); usb_close
-
Thread
Spartan 3AN Constraints Problem
[code] ERROR:ConstraintSystem:59 - Constraint <PULLDOWN ;> [s3astarter.ucf(27)]: NET "BTN_SOUTH" not found. Please verify that: 1. The specified design element actually exists in the original design. 2. The specified object is spelled correctly in the constraint source file. [/code] Jetzt
der lautet genau: [code] ERROR:HDLParsers:802 - "/ichBinEinPfad/eq.vhd" Line 14. BTN_SOUTH is not a boolean expression. ERROR:HDLParsers:826 - "/idhBinEinPfad/eq.vhd" Line 14. When condition BTN_SOUTH is not of type BOOLEAN. [/code] MfG André
-
Thread
Embedded Linux Kernel debuggen
.bss : 0xa001c740 - 0xa004370c ( 156 kB) SLUB: Genslabs=13, HWalign=32, Order=0-3, MinObjects=0, CPUs=1, Nodes=1 NR_IRQS:16 nr_irqs:16 16 OF: no ranges; cannot translate System timer is /soc/timer@E0004000 OF: no ranges; cannot translate Kernel panic - not syncing: Can't remap registers
0x01; FIO2DIR |= 1;*/ } } while(node != NULL); /* check whether a node was found */ if(node == NULL) { panic("No system timer found"); } } [/C] Testen konnte ich es noch nicht, aber es erscheint mir nun alles relativ plausibel. Was ich damit machen will - im
-
Thread
[Atmega8]LCD-Display+UART
bei der ich nicht weiß wie ich sie beheben soll! Weiß es einer von euch ? gcc plug-in: Error: Object file not found on expected location C:\Documents and Settings\Administrator\Desktop\LCD_Total\default\LCD_Total.elf c:/winavr-20080610/lib/gcc/../../avr/include/util/delay.h:90:3: warning: #warning
-
Thread
zugriff auf AVR -SRAM in ASM und C
Dank an euch beide! Jetz bekomme ich allerdings dauernd die Fehlermeldung: gcc plug-in: Error: Object file not found on expected location C:\Dokumente und Einstellungen\......\dmx_asm_c_test.elf Irgendwie mag das AVR-Studio 4.14 mein Assembler-file nicht. Es ist mein erstes Projekt in dem ich
-
Thread
Erweiterbares Ethernetboard mit MMC/SD-Slot und USB
aufgerufen und die TCP-Verbindung geschlossen. Für ein Beispiel schau Dir auch mal httpd_module_file_callback() an. Hier werden die Dateien der Speicherkarte stückweise rausgeschickt. Gruß, Roland
Das AVR-Studio mag aber mit dem makefile nicht richtig umgehen und wirft die bekannte Meldung "Object file not found on expected location". Deswegen habe ich ein Projektfile fürs Studio und einen Patch angehängt, evtl. hilft das dem einen oder anderen. Die richtigen Einstellungen fürs XMEM waren
-
Thread
WordClock mit WS2812
File "serial\serialutil.pyo", line 282, in __init__ File "serial\serialwin32.pyo", line 66, in open SerialException: could not open port 'COM7': WindowsError(5, 'Zugriff verweigert') [/code]
Nucleo powered laptop (still not done as it is described on the website) is not cut. ESP powered by a separate power supply does not work (weight combined with Nucleo)
-
Thread
C++ DLL in Labview einbinden
DLL 1 ist das unterste Schicht in VStudio dann DLL2 ist der zweite Schicht dann meine Main_Object "GUI", wo ich die beide DLL 1 und DLL 2 aufrufe. beide DLL File sind in der C++ ale eigene Projeckt
warum nicht die Add Funktion weiss es nicht. das ist auch den Report, die ich dazu bekomme: VI Not Executable The VI is not executable because of one of the following reasons: 1. The shared library or a dependent file is not installed. To make the VI executable, you must install the shared library
-
Thread
Fehler bei der Bibliothekinitialisierung in Keil 5
beheben könnte? Die Fehlermeldung lautet "fatal error in include chain (stm32f407xx.h):'core_cm4.h' file not found" Software Pack für STM32F407VGTx habe ich schon mit dem Pack Installer aufgespielt. (Siehe Anhang) Paths sind eigentlich auch alle initialisiert.(Siehe Anhang) PS: Das Einzig was
Fehlermeldungen und Warnungen: "Program Size: Code=684 RO-data=408 RW-data=0 ZI-data=1632 ".\Objects\Beispiel1.axf" - 0 Error(s), 0 Warning(s). Build Time Elapsed: 00:00:21"
-
Thread
8051 Assembler + Linker für WINDOWS 10/11
041EH *** FATAL ERROR L250: CODE SIZE LIMIT IN RESTRICTED VERSION EXCEEDED MODULE: .\Objects\hektar_main.obj (-----) LIMIT: 0800H BYTES Target not created. Build Time Elapsed: 00:00:00 [/code] Anbei das komplette Projekt Juergen
Hättest du dir meine Antwort angesehen dann hättest du es gesehen. Siehe .lst File. So hast du jetzt mehrere Lösungen.
-
Thread
Comvisu für Linux
noch: ./ComvisuV051: error while loading shared libraries: libQtWebKit.so.4: cannot open shared object file: No such file or directory libqtWebKit4 habe ich installiert... Hast du eine Idee wo das Problem sein könnte? Danke.
.0 (0x76edb000) libdl.so.2 => /lib/arm-linux-gnueabihf/libdl.so.2 (0x76ec8000) libQt4Pas.so.5 => not found libX11.so.6 => /usr/lib/arm-linux-gnueabihf/libX11.so.6 (0x76db2000) libc.so.6 => /lib/arm-linux-gnueabihf/libc.so.6 (0x76c73000) /lib/ld-linux-armhf.so.3 (0x54ae8000) libxcb.so.1 => /usr/
-
Thread
Problem mit WinAVR/AVR-STudio
dass eine *ELF* Datei fehlt. http://www.mikrocontroller.net/articles/WinAVR#gcc_plug-in:_Error:_Object_file_not_found_on_expected_location Man sollte dann vom Message-Tab zum Build-Tab wechseln, und nachsehen, was im Sourcecode falsch ist und warum der Kopilierversuch abgebrochen wurde.
-
Thread
[ISE 10.1] ConstraintSystem:59 Error
Hi, ich habe in meinem UCF File Nets und in der dazugehörigen Entity Signale auskommentiert. Ich verwende diese Signale im kompletten Design nicht mehr. Trotzdem bekomme ich beim Translate folgenden Fehler: ERROR:ConstraintSystem:59 - Constraint <NET "SECU1_OUT" S>: NET "SECU1_OUT" not found. Please verify that: 1. The specified design element actually exists in the original design. 2. The specified object is spelled correctly in the constraint source file. Ich meine
-
Thread
UART senden
ich zumindest die passende Deklaration gefunden. Binde ich die Datei ein, meckert der Compiler (Object file not found on expected location D:\...). Wenn mir da mal einer nen Anstoß geben könnte wäre ich froh. M f G Sebastian
-
Thread
BusyBox, Programm installieren
BusyBox damit nichts anfangen: [code]> cd /usr/bin > ls | grep m4 m4 > ./m4 -/bin/ash: ./m4: not found [/code] Da BusyBox wohl eine einzelne Executable ist, frage ich mich, ob das so überhaupt gehen kann? Kann ich irgendwo was reinschreiben, so das BusyBox 'm4' findet? Oder muss ich BusyBox
Was sagen $ file /usr/bin/m4 $ LD_TRACE_LOADED_OBJECTS=1 /usr/bin/m4 Matthias
-
Thread
Diverse fragen zu Hash Maps in C
, library will not be threadsafe! [-W#pragma-messages] #pragma message ("DANGER: C atomic or threads support missing, library will not be threadsafe!") ^ In file included from set-and-map.c:26: In file included
/dpa/utils/_set-and-map.common.h(40,10): fatal error: 'src/set-and-map.c' file not found #include DPA__U_SM_TEMPLATE ^~~~~~~~~~~~~~~~~~ set-and-map.c(79,28): note: expanded from macro 'DPA__U_SM_TEMPLATE' #define DPA__U_SM_TEMPLATE <src/set-and-map.c>
-
Thread
Ambilight mit STM32F4discovery und TVP5150AM1
The file formats in your rar file are not usable for me. Can you make PDF files of the schematic? Especially the TVP input and connection to the STM32 are important.
a comercial product based on the same hardware components. As he didn't publish any details, I do not know if his binary file works on your hardware - probably not. pitschu
-
Thread
Kreisfunktionen mit GCC
die Kreisfunktionen verwenden möchte bekomme ich folgende Fehlermeldung: gcc plug-in: Error: Object file not found on expected location C:\Dokumente und Einstellungen\lab5kobe\Desktop\Umrechnung\default\Umrechnung.elf (nicht gerade vielsagend , ich weis^^) Ich habe versucht den Fehler einzukreisen
-
Thread
EMS > Adapter > NetIO > Raspi
://homeserver/EMS/?seite=a_emslog.php [Thu Mar 12 20:43:16 2015] [error] [client 192.168.178.23] File does not exist: /data/apache/EMS/graphs/aussentemp-hour.png, referer: http://homeserver/EMS/?seite=a_emshour.php [Thu Mar 12 20:43:16 2015] [error] [client 192.168.178.23] File does not exist: /data
//homeserver/EMS/?seite=a_emshour.php [Thu Mar 12 20:43:16 2015] [error] [client 192.168.178.23] File does not exist: /data/apache/EMS/graphs/ww-hour.png, referer: http://homeserver/EMS/?seite=a_emshour.php [Thu Mar 12 20:43:16 2015] [error] [client 192.168.178.23] File does not exist: /data/apache