-
Thread
"Object File Not Found"
loscoden. Habe überhauptkeine Einstellungen im Studio vorgenommen. Tia und jetzt klappt das mit dem elf File nicht, wenn ich irgend einen Inlude Path wähle (wie gesagt, selbst wenn ich garkeine Datei einbinde!!!) Hier nochmal die Fehlermeldung: gcc plug-in: Error: Object file not found on expected location
> Object file not found on expected location Hast du dir mal die Fehlermeldungen des Compilers angeguckt? Wenn ich mich recht entsinne (ich nehme AVR Studio nicht, sehe es nur hin und wieder bei Kollegen
-
Thread
Object-file not found...GCC/AVRstudio
von ihm(Uli, Version 2.5) in den Projektordner verschoben. Dann habe ich im Studio alle .c und .h Files zum Projekt hinuzugefügt und das externe Makefile zum compilieren ausgewählt. Hat auch funktioniert, nur beim Build meckert das Studio rum. Diese Fehlermeldung kommt: gcc plug-in: Error: Object file not found on expected location C:\Dokumente und Einstellungen\mlueder\Eigene Dateien\mmc\mmc.elf Wie kann ich dem Studio beibringen, das er die main.elf erzeugen soll und nicht immer die mmc.elf?
-
Thread
error : object file not found...
zusammen ich verwende angehängtes makefile und bekomme immer den error : gcc plug-in: Error: Object file not found on expected location C:\Documents and Settings\ml\Desktop\ATmegaBOOT\ATmegaBOOT.elf Make sure your makefile specifies the output .elf file as ATmegaBOOT.elf leider finde ich das
-
Thread
Error: Object file not found on expected location
Variablen in die functions.h verschiebe, gibts immer diese schöne Meldung: [pre] gcc plug-in: Error: Object file not found on expected location G:\uC\m8515.elf [/pre] Das Kompilieren funzt wenn: gesamten Nebenfunktionen: in main.c globale Var Deklarationen: in main.c Das Kompilieren funzt NICHT
-
Thread
AVR Studio gcc plug-in: Error: Object file not found
: Error: Object file not found on expected location C:\...\pwm-test.elf es gibts hier zwar schon ein paar threads dazu aber irgendwie werde ich daraus nicht schlau. Irgendwas muss ich wohl übersehen. Kann mir jemand
pwm-test.elf c:/programme/winavr-20080430/bin/../lib/gcc/avr/4.3.0/../../../../avr/lib/avr4/crtm8.o: file not recognized: File format not recognized make: *** [pwm-test.elf] Error 1 Build succeeded with 0 Warnings...
-
Thread
gcc plug-in: Error: Object file not found on expected locati
h Datei mit einbinde (#include sseg.h) dann bekomme ich fogenden Fehler: gcc plug-in: Error: Object file not found on expected location [..].elf Wenn ich das include raus nehme, bekomme ich nur noch Warning: implicit declaration of function x (is ja klar). Das Programm läuft zwar aber eigentlich
Timo P schrieb im Beitrag #1922343: > Fehler: gcc plug-in: Error: Object file not found on expected locati Update dein AVR Studio bitte auf eine halbwegs aktuelle Version, die den exit-Status von "make" ordentlich auswertet, statt sich auf das Parsen von Textmustern
-
Thread
gcc plug-in: Error: Object file not found on expected locati
und itoa() Funktionen verwenden will, bekomme ich nach dem Compilen immer: gcc plug-in: Error: Object file not found on expected location Habe schon ein bissal gegoogelt und folgende Einstellungen im AVR Studio gemacht. Im Linker habe ich "-lm" eingetragen und unter Libraries die libm.a hinzugefügt
() Funktionen verwenden will, bekomme ich > nach dem Compilen immer: > > gcc plug-in: Error: Object file not found on expected location Meistens ist das ein Hinweis darauf, dass es während des compilierens einen Fehler gab.
-
Thread
gcc plug-in: Error: Object file not found on expected ....
für einen Atmega128 im AVR-Studio mit GNU-C kommt folgende Fehlermeldung: "gcc plug-in: Error: Object file not found on expected location C:\avr\Cosmo\default\meinproggi.elf" Der Quellcode wird anscheinend ohne Fehler aber mit einige Warnings kompiliert. Aber irgenwie schmiert da dann was ab :-?
-
Thread
"gmake" not found
STEmWinTest **** gmake all Cannot run program "gmake": Launching failed Error: Program "gmake" not found in PATH [/code]
files AS_EXT = S # wildcard for ASM source files (all files with AS_EXT extension found in # current folder and SRCS_DIRS folders will be compiled and linked) AS_SRCS = $(wildcard $(patsubst %, %/*
-
Thread
.elf datei not found
.eeprom=0 --no-change-warnings ## Objects that must be built in order to link OBJECTS = test.o ## Objects explicitly added by the user LINKONLYOBJECTS = ## Build all: $(TARGET) test.hex test.eep test.lss## Compile test.o: ../test.c
fpack-struct -fshort-enums -MD -MP -MT test2.o -MF dep/test2.o.d -c ../test2.c /usr/bin/sh: -Wall: command not found make: [test2.o] Error 127 (ignored) mmcu=atmega168 -Wl,-Map=test2.map test2.o -o test2.elf /usr/bin/sh: -Wl,-Map=test2.map: command not found make: [test2.elf] Error 127 (ignored) avr-objcopy
-
Thread
texane ST-Link geht schief---> makefile fehler
C object CMakeFiles/stlink-static.dir/src/sg.c.o [ 14%] Building C object CMakeFiles/stlink-static.dir/src/logging.c.o [ 17%] Building C object CMakeFiles/stlink-static.dir/src/flash_loader.c.o [ 20%] Linking
C object CMakeFiles/stlink-static.dir/src/sg.c.o [ 16%] Building C object CMakeFiles/stlink-static.dir/src/logging.c.o [ 20%] Building C object CMakeFiles/stlink-static.dir/src/flash_loader.c.o [ 23%] Linking
-
Thread
GGC: Problemme Test Projekt
---------- Beim erstellen des Projektes bekomme ich folgende Fehlermeldung: gcc plug-in: Could not insert Project data into Project tree gcc plug-in: Error: Object file not found on expected location C:\Program Files (x86)\Stardock\Object Desktop\DeskScapes\Atmega8515\default\Atmega8515.elf Loaded
plug-in: CProjectTree::OnSize() gcc plug-in: CProjectTree::updateControlDataFromProject() Could not find source file in Project datastructure gcc plug-in: Could not insert Project data into Project tree gcc plug-in: Error: Object file not found on expected location C:\Program Files (x86)\Stardock
-
Thread
Motorola Vip19x0 (Big brother of Vip1710)
Try one of the images listed above and check the log file. If the log shows it found and loaded the drivers the SDK has them. If not you have to compile them yourself
stm-nand-flex.1 not found 00:00:01 01.01.2000 os/ipc/shm.c 184 DBG > _shmOpen: Waiting for SHM file /shmSegment1 00:00:01 01.01.2000 os/ipc/shm.c 184 DBG > _shmOpen: Waiting for SHM file /shmSegment1 00:00
-
Thread
Ubuntu test.o file not found
> -sh ./test.o not found Was für ein Format hat test.o denn? Das hört sich so verdächtig nach Objektdatei an (also nicht ausführbar gelinkt). HTH
> Fehlermeldung -sh ./test.o not found... Entweder ist test.o keine Executable (was sagt "file test.o"?) oder es fehlen shared objects (was sagt "ldd test.o"?) oder du hast das falsche Terminal erwischt (biste auf der richtigen
-
Thread
gcc/studio : elf-file not found
c_project neu eingerichtet, Compiler läuft auch ohne Fehler durch, aber dann kommt die message: object file does not exist: Loaded objectfile: ....\default\c_project.elf Das file ist aber da ! wird ja offensichtlich vom Compiler erzeugt, ebenso wie das directory ...\default. Was muss ich da tun
0,0,0,0,0,0,0,0 }; Diese Konstruktion löst folgende Fehlermeldung aus: gcc plug-in: Error: Object file not found on expected location D:\Otto\I B O R\Projekte\C_PROJECT\C_Project\default\C_Project.elf Wenn ich die Array-Definition auskommentiere und natürlich auch die Zugriffe darauf, dann
-
Thread
Library in Linker einbinden: Fehler not found
Ich bin wieder mal am rätseln. Ich möchte vom CMSIS die Funktionen für FOC nutzen (Park, Clark etc) Die Funktionen sind in der arm_math.h deklariert, die CubeMX beim Anlegen des Projektes auch im Projektordner ablegt. Die genutzte Library wird aber nicht automatisch angezogen. Ich habe versucht, sie wie hier beschrieben einzubinden, das gibt aber immer eine Fehlermeldung vom Linker. https://mcuoneclipse.com/2013/02/14/tutorial-using-the-arm-cmsis-library/ [c]arm-none-eabi-gcc -mcpu=cortex-m3 -mthumb -mfloat-abi=soft -L"C:\CMSIS_5-develop\CMSIS_5-develop\CMSIS\/Lib/ARM" -specs=nosys.specs
-
Thread
Webpack: Paket fehlt
common/bin/lin64/_xlcm linux-vdso.so.1 => (0x00007fff3c918000) libPortability.so => not found libQt_Gui.so => not found libQt_Core.so => not found libQt_Network.so => not found libSecurity.so => not found libCurl_Curl.so => not found libOpenSSL_Crypto.so => not found libOpenSSL_SSL.so => not found libPort_Std.so => not found libThread.so => not found libZlib.so => not found libMiniZip.so => not found libboost_regex-gcc41
-
Thread
arm gcc 7.2.1 -flto broken?
RMszal schrieb im Beitrag #5283733: > What's more weird > is that this issue depends on order of object files in linking. If > startup file is placed first on object list, then LTO works fine. When I > change file order, every IRQ_Handler that is placed before statup file > on a linking list will
not be resolved by adding some compiler flags/attributes to the weak declaration inside startup, but I haven't found any clue so far. I'll try to compare weak declarations inside C compiled objects.
-
Thread
Pollin MOTOROLA VIP1710
usr/bin usw usf. Dabei konnte man sie Problemlos dahin kopieren und es kam eben immer der Fehler, File not found oder Dergleichen. Also ich habe hier gerade gelesen "Box bootet nicht, blinkt nur", dieses Problem hatte ich auch zu erst, als ich das Netzteil, welches ich damals für die Zoom-Box verwendet
MPlayer 1.0rc1-4.1.2-DFSG-free (C) 2000-2006 MPlayer Team CPU: SGI MIPS Terminal type `vt102' is not defined. mplayer: could not open config files /.lircrc and /etc/lirc//lircrc mplayer: No such file or directory Failed to read LIRC config file ~/.lircrc. Playing /mnt/1.mpg. MPEG-PS file format
-
Thread
Über NetIO beim Raspberry eine LED einschalten
not found So sieht es grade bei mir aus! was mache ich falsch??? Und danke für den Tipp der Grundlagenbücher
egg-info pi@raspberrypi ~/RPi.GPIO-0.5.4 $ sudo ./netio_server.py sudo: ./netio_server.py: command not found habt doch jetzt alles installiert warum geht das jetzt nicht mit dem netio_server.py???
-
Thread
Arduino - UNO Flashershield (Linux)
open shared object file: No such file or directory Ein libtermcap* habe ich in /lib/x86_64-linux-gnu nicht gefunden und auch unter /lib nicht.
usr/local/bin/flashershield: ELF: not found /usr/local/bin/flashershield: 2: /usr/local/bin/flashershield: �: not found /usr/local/bin/flashershield: 3: /usr/local/bin/flashershield: �: not found /usr/local/bin/flashershield: 4: /usr
-
Thread
Wo ist die util/delay.h?
hrm joa gemacht...neuste version drauf gemacht.... nun bekomme ich das "gcc plug-in: Error: Object file not found on expected location Y:\C\07.LCD-Display\LCD\default\LCD.elf"
gemacht...neuste version drauf gemacht.... > > nun bekomme ich das > > "gcc plug-in: Error: Object file not found on expected location > Y:\C\07.LCD-Display\LCD\default\LCD.elf" http://www.mikrocontroller.net/articles/WinAVR#gcc_plug-in:_Error:_Object_file_not_found_on_expected_location
-
Thread
SmuView - Eine sigrok GUI für Netzteil, Multimeter und mehr
als auch mit vERSION 0.0.3... ... Scanning dependencies of target smuview [ 2%] Building CXX object CMakeFiles/smuview.dir/main.cpp.o [ 3%] Building CXX object CMakeFiles/smuview.dir/src/devicemanager.cpp.o In file included from /home/majo/tmp/smuview-master/src/devices/basedevice.hpp:34,
src/ui/dialogs/connectdialog.cpp:30: /usr/include/x86_64-linux-gnu/qt5/QtCore/qvariant.h:528:17: note: declared here 528 | inline QVariant qVariantFromValue(const T &t) | ^~~~~~~~~~~~~~~~~ cc1plus: all warnings being treated as errors make[2]: *** [CMakeFiles/smuview.dir/
-
Thread
Atmega8 - DS1621 auslesen ( über TWI[ i2c]) Gesperrt
\ gcc plug-in: Error: Object file not found on expected location C:\TempDS1621\default\TempDS1621.elf gcc plug-in: Error: Object file not found on expected location C:\TempDS1621\default\TempDS1621.elf Hab das Projekt genauso
und wenn kein Programm erzeugt wird, kann das gcc-plugin auch keins finden (gcc plug-in: Error: Object file not found on expected location C:\TempDS1621\default\TempDS1621.elf). Die Fehlermeldung des Linkers steht eventuell auf einem anderen Fenster (Tabellenreiter Build?) in AVRStudio. Wieso
-
Thread
GPS Koordinaten händisch in die EXIF Daten eines Fotos eingeben
Start von digikam nur [code] digikam(6002)/kdeui (KIconLoader): Error: standard icon theme "oxygen" not found! Object::connect: No such signal org::freedesktop::UPower::DeviceAdded(QDBusObjectPath) Object::connect: No such signal org::freedesktop::UPower::DeviceRemoved(QDBusObjectPath) QSqlDatabasePrivate
::Private::loadSequence: Invalid pixmap specified. digikam(6002) KXMLGUIClient::loadStandardsXmlFile: ui/ui_standards.rc not found in ("/home/dirk/.kde/share/config/", "/etc/kde4/", "/usr/share/kde4/config/") QFSFileEngine::open: No file name specified !!!!!!! ERROR !!!!!!! - KHTML default stylesheet
-
Thread
Simulink mit Modelsim verlinken
: File not found. # ** Warning: (vsim-FLI-3160) Failed to load FLI object file "E:Program". # Region: /inverter [/c] Danke.
" failed: File not found. # ** Warning: (vsim-FLI-3160) Failed to load FLI object file "E:/Program". # Region: /inverter [/c]
-
Thread
.elf Fehler - kommt immer wieder und macht mich wahnsinnig Gesperrt
main() { int i; while(1) { } return 0; } [/c] Fehler: gcc plug-in: Error: Object file not found on expected location C:\temp\test\default\test.elf Bitte dringend um Hilfe, werde sonst meine Tastatur mit dem Monitor bekannt machen ;) (...) ____ AVRStudio v4.13 ServicePack
Ursachen findest Du mit Hilfe der erwähnten Suchfunktion: http://www.mikrocontroller.net/search?query=Object+file+not+found Auch das Wiki enhält einen entsprechenden Abschnitt: http://www.mikrocontroller.net/articles/WinAVR#gcc_plug-in:_Error:_Object_file_not_found_on_expected_location Inclusive weiterer
-
Thread
Warum führt -Wshadow zu "linker input file unused because linking not done"
) {} int Foo::bar(int a, int b) { return a + b; } [/c] Output: [code] [ 50%] Building CXX object CMakeFiles/mylib.dir/mylib.cpp.o c++: warning: −Wshadow: linker input file unused because linking not done c++: error: −Wshadow: linker input file not found: No such file or directory make[2]: *
c++: warning: Wshadow: linker input file unused because linking not done c++: error: Wshadow: linker input file not found: No such file or directory make[2]: *** [CMakeFiles/mylib.dir/build.make:76: CMakeFiles/mylib.dir/mylib.cpp.o] Error
-
Thread
AVR Studio Fehler
plugin STK500 Loaded plugin AVR GCC Loaded partfile: D:\Programme\AVR_Studio\PartDescriptionFiles\ATtiny12.xml gcc plug-in: Error: Object file not found on expected location C:\Dokumente und Einstellungen\Steffen Oesterwind\Eigene Dateien\default\Ledeinb.elf --------------------------------
Hi, die Meldung "gcc plug-in: Error: Object file not found on expected location" ist nur ein Folgefehler. Der eigentliche Fehler ist der andere mit "CreateProcess ... failed". Meistens stimmt die PATH Variable dann nicht. CU
-
Thread
Konrad KA3005 unter Linux ansteuern
stripped /opt/korad$ ldd korad linux-vdso.so.1 => (0x00007ffff255d000) libqwt.so.6 => not found libQt5Widgets.so.5 => not found libQt5Gui.so.5 => not found libQt5SerialPort.so.5 => not found libQt5Core.so.5 => not found libGL.so.1 => not found
auch schön, warum ldd bei unbekannten Binaries unsicher ist): [code] /opt/korad$ LD_TRACE_LOADED_OBJECTS= ./lib/ld-linux-x86-64.so.2 ./bin/korad_real linux-vdso.so.1 => (0x00007fffccef1000) libqwt.so.6 => not found libQt5Widgets.so.5 => not found libQt5Gui.so.5 =>
-
Thread
atof("123.34") will nicht ERROR?
g_dou = atof(g_buftmp); Wenn ich nun auf compilieren drücke kommt: gcc plug-in: Error: Object file not found on expected location D:\Atmel\C\HelloWorld\default\HelloWorld.elf Build started 25.7.2007 at 10:18:10 c:/winavr-20070525rc2/bin/../lib/gcc/avr/4.1.2/../../../../avr/lib/avr5\libc.a
> gcc plug-in: Error: Object file not found on expected location Da hat AVR Studio nicht geschnallt, dass deine Compilierung fehlerhaft war. Guck mal in den Messages nach, was die Ursache ist.
-
Thread
bekomme lcd nicht zum laufen!
plugin STK500 Loaded plugin AVR GCC Loaded partfile: C:\Programme\Atmel\AVR Tools\PartDescriptionFiles\AT90S8535.xml gcc plug-in: Exported makefile to c:\Dokumente und Einstellungen\Desktop\lcd_oli\Makefile gcc plug-in: Error: Object file not found on expected location c:\Dokumente und Einstellungen
laufwerk c im ordner drinnen, aber er will mir das noch immer nicht laufen lassen: gcc plug-in: Error: Object file not found on expected location C:\da_oli\displ1\default\displ1.elf
-
Thread
DLL in Matlab
Function pointer types are unsupported in structures HRESULT ( * QueryInterface )( ILayoutStorage * . Found on line 44385 of input from line 13358 of file C:/ProgramData/MATLAB/SupportPackages/R2017a/MW_MinGW_4_9/x86_64-w64-mingw32/include/objidl.h dann solche hier: Type 'LARGE_INTEGER' was not found. Defaulting to type error. Found on line 59792 of input from line 241 of file C:/ProgramData/MATLAB/SupportPackages/R2017a/MW_MinGW_4_9/x86_64-w64-mingw32/include/winioctl.h und sowas: Failed to parse type '( __cdecl__ ))
-
Thread
SD-Karte an PIC18F4620
copy file object over FileObjectCopy(&gFileTemp, filePtr); // See if the file is found if(FILEfind (filePtr, &gFileTemp, LOOK_FOR_MATCHING_ENTRY, 0) == CE_GOOD) { // File is Found
condition break; } } else { #ifdef ALLOW_WRITES // the file was not found, reset to the default asked FileObjectCopy(filePtr, &gFileTemp); // File is not Found if(ModeC == 'w' || ModeC == 'W' || ModeC == 'a' || ModeC == 'A')
-
Thread
Anfänger in C Grundlagenfragen
ein Projekt daraus erstellt. Built bringt dann folgende Fehlermeldung: gcc plug-in: Error: Object file not found on expected location C:\1Wire\default\1Wire.elf Selbst wenn ich das Makefile von Daniel B. verwende, klappt es nicht. Benutze ich das Batchfile von Peter Dannegger in einer DOS-Box
Karl-alfred Römer schrieb: > Built bringt dann folgende Fehlermeldung: > gcc plug-in: Error: Object file not found on expected location > C:\1Wire\default\1Wire.elf 1.) Sieh dir die Compilermeldungen bitte mal an statt der Meldungen von AVR Studio. 2.) Eigentlich solltest du diese Meldung
-
Thread
Ein leztes Mal: "No rule . . ."
anstatt /. Jetzt habe ich immer noch ne Fehlermeldung, allerdings ne andere: gcc plug-in: Error: Object file not found on expected location Q:\{Daten\{code\C\Projekte\2006\16bittimer\16bittimer.elf Make sure your makefile specifies the output .elf file as 16bittimer.elf gcc plug-in: Error: Object file not found on expected location Q:\{Daten\{code\C\Projekte\2006\16bittimer\16bittimer.elf Make sure your makefile specifies the output .elf file as 16bittimer.elf Ändere ich in der Makefile: # Target
-
Thread
ModelSim optimiert Signale weg - wie verhindern?
terminiert die Simulation mit... [code] # ---------Loading std wave .. # ** Error: (vsim-3561) No objects found matching 'stop_simulation'. # Error in macro ./dofiles/run_test.do line 25 # ** Error: (vsim-3561) No objects found matching 'stop_simulation'. # while executing # when -label l_break
vcom -O0 -norangecheck +acc -work {deineLib} {deinFile} +acc steuert die Sichtbarkeit von internenen Signalen, die sonst wegoptimierten werden ("Enable access to certain objects which might otherwise be optimized away.") MfG,
-
Thread
ISE ERROR ConstraintSystem
:59 - Constraint <NET "Clk_FBp" S>: NET "Clk_FBp" not found. Please verify that: 1. The specified design element actually exists in the original design. 2. The specified object is spelled correctly in the constraint source file. ngdbuild ERROR ConstraintSystem:59 - Constraint <NET "Clkp" S>: NET "Clkp" not found. Please verify that: 1. The specified design element actually exists in the original design. 2. The specified object is spelled correctly in the constraint source file. Gruß Frank
-
Thread
Handydummy (Attrappe)mit richtigem Display 10Zoll - u.a.Motorola Xoom
] not found in the path ! PathAPI__Fopen_UTF16: Error! file not found. file access mode is [rb] => return. !!!!!!!! ReadSetupValueFromFile cannot find file !!!! ChangeLanguage bLanguage=0 !!!!!! warnnig
? [code] PathAPI__Locate_Path_UTF16: file [SET_FILE.csv] not found in the path ! PathAPI__Fopen_UTF16: Error! file not found. file access mode is [rb] => return. !!!!!!!! ReadSetupValueFromFile cannot find file !!!! ChangeLanguage bLanguage
-
Thread
Assembler Schrittweise Debuggen (AVR-gcc)
4 kb großen .elf. Es lässt sich zwar im AVRStudio öffnen, jedoch meldet dies: Coordinator: The object file does not contain source code information. Eine Datei ccQNdaaa.s gibt es nicht, nicht mal das zugehörige verzeichnis.
debugging swapit.elf swapit.cof (mit den 3 Warnungen) AVRStudio meldet weiterhin: Coordinator: The object file does not contain source code information.
-
Thread
projekt in AVR studio 4 laden
was ich bekomme sind Fehlermeldungen die da lauten: D:\AVR-Info\RC_SUM_GEN\SourceCode\main.c: is not a AVR Studio 4-savefile gcc plug-in: Error: Object file not found on expected location D:\AVR-Info\RC_SUM_GEN\SourceCode\RcSender.elf Ich bin schon am Verzweifeln wieso geht das nicht wie bei
du den > WinAVR installiert hast, oder ? Wolfgang Hopperdietzel wrote: > gcc plug-in: Error: Object file not found on expected location > D:\AVR-Info\RC_SUM_GEN\SourceCode\RcSender.elf Ansonsten kann ich nur zustimmen: Neues Projekt erstellen, Sourcen angeben und es sollte laufen. Allerdings
-
Thread
Update auf ISE 11.4 unter Linux
`include/config/auto.conf'. Stop. make: *** [modules] Error 2 0 checking for right linked object... windrvr_gcc_v3.a checking for modpost location... not found configure: error: can't find modpost at /usr/src/linux/scripts make: *** Keine Regel, um »clean« zu erstellen. Schluss. make: ***
not exist. --Error getting file version for /etc/hotplug/usb/xusbdfwu.fw/xusb_xse.hex. --Updating xusb_xse.hex file. cat: /etc/hotplug/usb.usermap: Datei oder Verzeichnis nicht gefunden
-
Thread
ise 10.1 time constraints
ConstraintSystem:59 - Constraint <NET "my_clock" S>: NET "my_clock" not found. Please verify that: 1. The specified design element actually exists in the original design. 2. The specified object is spelled correctly in the constraint source file. ERROR:ConstraintSystem:59 - Constraint <NET "my_button" S>: NET "my_button" not found. Please verify that: 1. The specified design element actually exists in the original design. 2. The specified object is spelled correctly in the constraint source file. Done...
-
Thread
Linux Mono dll in c# einbinden
(void); Kompilieren klappt ohne Fehler, beim Programmstart kommt jedoch die Meldung: System.DllNotFoundException: cplib Hab das config File schon in den bin/debug ordner kopiert und ins Projektverzeichnis jedoch ändert sich nichts. Die Datei cplib.so kann ich auch nirgends finden, muss ich
file. This is not limited to executables, you can also configure libraries, for example "library.dll" and "library.dll.config".
-
Thread
ISE14.7 unter opensuse 13.1
-Installer version = 1100 --Unsetting ARCH environment variable. --User has root permission. --File /lib/modules/misc/install_windrvr6 does not exist. --Installing USB drivers------------------------------------------ --File /etc/hotplug/usb/xusbdfwu.fw/xusbdfwu.hex exists. --File /etc/hotplug/
usermap. --Installing windrvr6--------------------------------------------- --Checking version. --File /lib/modules/3.11.6-4-desktop/kernel/drivers/misc/windrvr6.ko does not exist. --File LINUX.3.11.6-4-desktop.x86_64/windrvr6.ko does not exist. --Setting source version to 1301. --File LINUX.3.11.6
-
Thread
Keil inline asm
" TO ".\Objects\float" PRINT(".\Listings\float.m51") CODE( 0x4000 ) *** FATAL ERROR L210: I/O ERROR ON INPUT FILE: EXCEPTION 0021H: PATH OR FILE NOT FOUND FILE: .\Objects\float.obj Target not created
SYMBOL: ?C_START MODULE: .\Objects\STARTUP.obj (?C_STARTUP) ADDRESS: 8010H Program Size: data=9.0 xdata=0 code=24 creating hex file from ".\Objects\float"... ".\Objects\float" - 0 Error(s), 3 Warning(s). Build Time Elapsed
-
Thread
EAGLE 3D - zeigt eure Projekte Bilder
oder kopiere den Code von oben gibts nen Error: #ifndef(pack_C12) #declare global_pack_C12=yes; object {CAP_DIS_ELKO_5MM_10MM("100uf/63V",5 Parse Error: Expected ')', float function 'float constant' found instead
I do not understand why it does not function the macro If your it is easy It added the file pov Or send it to me in e-mail sulis1281100@yahoo.com
-
Thread
Eclipse Plugin für Fujitsu 16bit µcs Gesperrt
Common gefehlt. Also, nachdem "run external tool" bekomme ich diese Fehler: *** F9011U: Input file not found (T0-Option=%(LOADMODULEFILE[PATH]).mhx) Ich verstehe nicht, ich habe (denk ich) die richtige Working Directory "${workspace_loc:/SOFTWARE_V01_S01_RC-rev0A/Release}" Drin ist auch mein
Fehler: make: *** [System/ce.o] Error 1 und am Ende des Kompiliervorganges: make: Target `all' not remade because of errors. Wenn ich danach nochmals bilde startet direkt der Linker und alles scheint okay zu sein. Habe die Object Files mit dem Output vom Softune Workbench verglichen, die sind
-
Thread
GNUARM Eclipse Plugin
find entry symbol _start; defaulting to 00008244 und beim Ausführen auf dem Target bekomme ich ein "not found". Irgend eine Idee, welche Einstellungen noch zu tätigen sind? Danke LG Fritz
geklappt, aber beim Ausführen des entstandenen Binaries auf dem Target kam entweder Segfault oder file not found. Danke trotzdem für eure Hilfe LG Fritz
-
Thread
[simulavr] Build-Problem
gcc... gcc checking whether the C compiler works... yes checking for C compiler default output file name... a.out checking for suffix of executables... checking whether we are cross compiling... no checking for suffix of object files... o checking whether we are using the GNU C compiler... yes
:70:23: note: declarations in dependent base ‘std::vector<std::pair<long long int, SimulationMember*>, std::allocator<std::pair<long long int, SimulationMember*> > >’ are not found by unqualified lookup systemclock.cpp