Fehler bei Microchip Beispiel Curiosity-Modul

Gast #4917305
Lesenswert?
• ▲
▼
Ich habe versucht das Beispiel mit dem Microchip Curiosity-Modul zu 
kompilieren. Dabei trat nachfolgende Fehlermeldung aus.
Wo muss ich den Fehler suchen?


You have compiled in FREE mode.
Using Omniscient Code Generation that is available in PRO mode,
you could have produced up to 60% smaller and 400% faster code.
See http://www.microchip.com/MPLABXCcompilers for more information.

make[2]: *** 
[dist/default/production/PIC16F1619_Cur_v315.X.production.hex] Error 1
make[1]: *** [.build-conf] Error 2
(908) exit status = 1
nbproject/Makefile-default.mk:429: recipe for target 
'dist/default/production/PIC16F1619_Cur_v315.X.production.hex' failed
make[2]: Leaving directory 
'M:/Klaus/Projekte/Test/PIC16F1619_Cur_v315.X'
nbproject/Makefile-default.mk:84: recipe for target '.build-conf' failed
make[1]: Leaving directory 
'M:/Klaus/Projekte/Test/PIC16F1619_Cur_v315.X'
nbproject/Makefile-impl.mk:39: recipe for target '.build-impl' failed
make: *** [.build-impl] Error 2

BUILD FAILED (exit value 2, total time: 21s)


Danke für alle Tipps.
Gast #4917332
Lesenswert?
• ▲
▼
Volker S. schrieb:
> Ist das wirklich alles, oder hast du nur einen Teil der Ausgabe
> gepostet?

Upps, Du hast recht.
Das ist wohl auch noch interessant:

:: warning: (1273) Omniscient Code Generation not available in Free mode
mcc_generated_files/tmr2.c:87: warning: (520) function "_TMR2_ModeSet" 
is never called
mcc_generated_files/tmr2.c:93: warning: (520) function 
"_TMR2_ExtResetSourceSet" is never called
mcc_generated_files/tmr2.c:121: warning: (520) function 
"_TMR2_Counter8BitGet" is never called
mcc_generated_files/tmr2.c:130: warning: (520) function 
"_TMR2_ReadTimer" is never called
mcc_generated_files/tmr2.c:135: warning: (520) function 
"_TMR2_Counter8BitSet" is never called
mcc_generated_files/tmr2.c:141: warning: (520) function 
"_TMR2_WriteTimer" is never called
mcc_generated_files/tmr2.c:146: warning: (520) function 
"_TMR2_Period8BitSet" is never called
mcc_generated_files/tmr2.c:151: warning: (520) function 
"_TMR2_LoadPeriodRegister" is never called
mcc_generated_files/tmr2.c:156: warning: (520) function 
"_TMR2_HasOverflowOccured" is never called
mcc_generated_files/tmr1.c:100: warning: (520) function 
"_TMR1_ReadTimer" is never called
mcc_generated_files/tmr1.c:109: warning: (520) function 
"_TMR1_WriteTimer" is never called
mcc_generated_files/tmr1.c:138: warning: (520) function 
"_TMR1_StartSinglePulseAcquisition" is never called
mcc_generated_files/tmr1.c:143: warning: (520) function 
"_TMR1_CheckGateValueStatus" is never called
mcc_generated_files/tmr1.c:148: warning: (520) function 
"_TMR1_HasOverflowOccured" is never called
mcc_generated_files/tmr0.c:86: warning: (520) function "_TMR0_ReadTimer" 
is never called
mcc_generated_files/tmr0.c:95: warning: (520) function 
"_TMR0_WriteTimer" is never called
mcc_generated_files/tmr0.c:101: warning: (520) function "_TMR0_Reload" 
is never called
mcc_generated_files/pin_manager.c:85: warning: (520) function 
"_PIN_MANAGER_IOC" is never called
mcc_generated_files/pwm1.c:98: warning: (520) function 
"_PWM1_OutputStatusGet" is never called
mcc_generated_files/adc.c:85: warning: (520) function 
"_ADC_StartConversion" is never called
mcc_generated_files/adc.c:100: warning: (520) function 
"_ADC_IsConversionDone" is never called
mcc_generated_files/adc.c:106: warning: (520) function 
"_ADC_GetConversionResult" is never called
mcc_generated_files/mcc.c:107: warning: (520) function 
"_WWDT_SoftEnable" is never called
mcc_generated_files/mcc.c:113: warning: (520) function 
"_WWDT_SoftDisable" is never called
mcc_generated_files/mcc.c:119: warning: (520) function 
"_WWDT_TimeOutStatusGet" is never called
mcc_generated_files/mcc.c:125: warning: (520) function 
"_WWDT_WindowViolationStatusGet" is never called
mcc_generated_files/mcc.c:131: warning: (520) function 
"_WWDT_TimerClear" is never called
:: error: (900) exec failed: C:\Program Files 
(x86)\Microchip\xc8\v1.41\bin\cromwell
Gast #4917337
Lesenswert?
• ▲
▼
Hallo Volker SK,

ich denke, das war auch schon der entscheidende Tipp. - Danke.

Bei dem XC8-Compiler V1.41 gibt es die Datei cromwell.exe nicht mehr.

Mit einer älteren Compiler-Version funktioniert es jetzt.

Antwort schreiben

Hinweis: der ursprüngliche Beitrag ist mehr als 6 Monate alt. Bitte hier nur auf die ursprüngliche Frage antworten, für neue Fragen einen neuen Beitrag erstellen.

Formatierung
  • [c]C-Code[/c]
  • [code]Code in anderen Sprachen, ASCII-Zeichnungen[/code]
  • [math]Formel in LaTeX-Syntax[/math]
  • [[Titel]] – Link zu einem Artikel
  • Verweis auf einen anderen Beitrag: Rechtsklick auf dessen Beitrags-ID (#8078628), „Adresse kopieren“, in den Text einfügen

Mehr zur Formatierung

Längeren Sourcecode als Anhang, nicht in den Text. JPG nur für Fotos und Scans; Zeichnungen und Screenshots als PNG oder GIF. Siehe Bildformate.

Schon registriert? Anmelden

Wird nicht angezeigt. Wir schicken dir einen Link; sobald du damit bestätigst, erscheint dein Beitrag.

Mit dem Abschicken legst du einen kostenlosen Account an und erkennst die Nutzungsbedingungen und die Datenschutzerklärung an.