-
Thread
Update auf ISE 11.4 unter Linux
`include/config/auto.conf'. Stop. make: *** [modules] Error 2 0 checking for right linked object... windrvr_gcc_v3.a checking for modpost location... not found configure: error: can't find modpost at /usr/src/linux/scripts make: *** Keine Regel, um »clean« zu erstellen. Schluss. make: ***
not exist. --Error getting file version for /etc/hotplug/usb/xusbdfwu.fw/xusb_xse.hex. --Updating xusb_xse.hex file. cat: /etc/hotplug/usb.usermap: Datei oder Verzeichnis nicht gefunden
-
Thread
ise 10.1 time constraints
ConstraintSystem:59 - Constraint <NET "my_clock" S>: NET "my_clock" not found. Please verify that: 1. The specified design element actually exists in the original design. 2. The specified object is spelled correctly in the constraint source file. ERROR:ConstraintSystem:59 - Constraint <NET "my_button" S>: NET "my_button" not found. Please verify that: 1. The specified design element actually exists in the original design. 2. The specified object is spelled correctly in the constraint source file. Done...
-
Thread
Linux Mono dll in c# einbinden
(void); Kompilieren klappt ohne Fehler, beim Programmstart kommt jedoch die Meldung: System.DllNotFoundException: cplib Hab das config File schon in den bin/debug ordner kopiert und ins Projektverzeichnis jedoch ändert sich nichts. Die Datei cplib.so kann ich auch nirgends finden, muss ich
file. This is not limited to executables, you can also configure libraries, for example "library.dll" and "library.dll.config".
-
Thread
ISE14.7 unter opensuse 13.1
-Installer version = 1100 --Unsetting ARCH environment variable. --User has root permission. --File /lib/modules/misc/install_windrvr6 does not exist. --Installing USB drivers------------------------------------------ --File /etc/hotplug/usb/xusbdfwu.fw/xusbdfwu.hex exists. --File /etc/hotplug/
usermap. --Installing windrvr6--------------------------------------------- --Checking version. --File /lib/modules/3.11.6-4-desktop/kernel/drivers/misc/windrvr6.ko does not exist. --File LINUX.3.11.6-4-desktop.x86_64/windrvr6.ko does not exist. --Setting source version to 1301. --File LINUX.3.11.6
-
Thread
Keil inline asm
" TO ".\Objects\float" PRINT(".\Listings\float.m51") CODE( 0x4000 ) *** FATAL ERROR L210: I/O ERROR ON INPUT FILE: EXCEPTION 0021H: PATH OR FILE NOT FOUND FILE: .\Objects\float.obj Target not created
SYMBOL: ?C_START MODULE: .\Objects\STARTUP.obj (?C_STARTUP) ADDRESS: 8010H Program Size: data=9.0 xdata=0 code=24 creating hex file from ".\Objects\float"... ".\Objects\float" - 0 Error(s), 3 Warning(s). Build Time Elapsed
-
Thread
EAGLE 3D - zeigt eure Projekte Bilder
oder kopiere den Code von oben gibts nen Error: #ifndef(pack_C12) #declare global_pack_C12=yes; object {CAP_DIS_ELKO_5MM_10MM("100uf/63V",5 Parse Error: Expected ')', float function 'float constant' found instead
I do not understand why it does not function the macro If your it is easy It added the file pov Or send it to me in e-mail sulis1281100@yahoo.com
-
Thread
Eclipse Plugin für Fujitsu 16bit µcs Gesperrt
Common gefehlt. Also, nachdem "run external tool" bekomme ich diese Fehler: *** F9011U: Input file not found (T0-Option=%(LOADMODULEFILE[PATH]).mhx) Ich verstehe nicht, ich habe (denk ich) die richtige Working Directory "${workspace_loc:/SOFTWARE_V01_S01_RC-rev0A/Release}" Drin ist auch mein
Fehler: make: *** [System/ce.o] Error 1 und am Ende des Kompiliervorganges: make: Target `all' not remade because of errors. Wenn ich danach nochmals bilde startet direkt der Linker und alles scheint okay zu sein. Habe die Object Files mit dem Output vom Softune Workbench verglichen, die sind
-
Thread
GNUARM Eclipse Plugin
find entry symbol _start; defaulting to 00008244 und beim Ausführen auf dem Target bekomme ich ein "not found". Irgend eine Idee, welche Einstellungen noch zu tätigen sind? Danke LG Fritz
geklappt, aber beim Ausführen des entstandenen Binaries auf dem Target kam entweder Segfault oder file not found. Danke trotzdem für eure Hilfe LG Fritz
-
Thread
[simulavr] Build-Problem
gcc... gcc checking whether the C compiler works... yes checking for C compiler default output file name... a.out checking for suffix of executables... checking whether we are cross compiling... no checking for suffix of object files... o checking whether we are using the GNU C compiler... yes
:70:23: note: declarations in dependent base ‘std::vector<std::pair<long long int, SimulationMember*>, std::allocator<std::pair<long long int, SimulationMember*> > >’ are not found by unqualified lookup systemclock.cpp
-
Thread
AVRdude hängt beim flashen
20000000 F_CPU = 8000000 # Output format. (can be srec, ihex, binary) FORMAT = ihex # Target file name (without extension). TARGET = main # Object files directory # To put object files in current directory, use a dot (.), do NOT make # this an empty or blank macro! OBJDIR = .
) $@ $(NM) -n $< > $@ # Create library from object files. .SECONDARY : $(TARGET).a .PRECIOUS : $(OBJ) %.a: $(OBJ) @echo @echo $(MSG_CREATING_LIBRARY) $@ $(AR) $@ $(OBJ) # Link: create ELF output file from object files. .SECONDARY
-
Thread
Hterm unter Linux Mint Cinnamon
.6 => not found libXrender.so.1 => not found libXi.so.6 => not found libXrandr.so.2 => not found libXcursor.so.1 => not found libXfixes.so.3 => not found libpango-1.0.so.0 => not found libX11.so.6 => not found libgobject-2.0.so.0 => not found libgmodule-2.0.so.0 => not found libgthread-2.0.so.0 => not found libglib-2.0.so.0 => not found libXinerama.so.1 => not found libSM.so.6 => not
-
Thread
Helpthread zum Wikiartikel AVR Eclipse
Ordner, dann bekomme ich folgende Ausgabe: [pre] make --no-print-directory post-build Invoking: Object to Hex Splitter avr-objsplit.bat /usr/bin/avr-objsplit.bat: 1: @avr-objcopy: not found /usr/bin/avr-objsplit.bat: 2: @avr-objcopy: not found /usr/bin/avr-objsplit.bat: 3: @if: not found make[1
im Wiki, dann schaut das ganze so aus: [pre] make --no-print-directory post-build Invoking: Object to Hex Splitter avr-objsplit.bat make[1]: avr-objsplit.bat: Command not found make[1]: [post-build] Error 127 (ignored)) [/pre] Die beiden Dateien liegen im /usr/bin/-Ordner und haben executable-Rechte
-
Thread
KiCad-Kompilierung
Python-2.7.11/ (Zeile 3) nicht existiert. Angeblich wird eine Datei daraus benutzt, es gibt aber kein "File not found". Jemand ne Idee? [pre] [...] [ 78%] Linking CXX shared module _pcbnew.so /usr/local/lib/libpython2.7.a(posixmodule.o): In function `posix_tmpnam': /Daten/Downloads/Python-2.7.11
2.7.11/ (Zeile 3) nicht existiert. Angeblich > wird eine Datei daraus benutzt, es gibt aber kein "File not found". Möglicherweise benötigst Du noch swig und wxPython aus dem Repository Ich habe mich bei meiner letzten Compilation im Herbst hieran orientiert: http://ci.kicad-pcb.org/job/kicad-doxygen
-
Thread
Array ins eeprom schreiben
Hallo wenn ich ein Array im eeprom definiere kommt immer der Fehler "gcc plug-in: Error: Object file not found on expected location C:\Dokumente und Einstellungen\Administrator\Eigene Dateien\Robotik\Projekte\C\Quattrokopter\Parabox\default\Parabox.elf" die eeprom.h habe ich auch includiert
@ Gast (Gast) >plug-in: Error: Object file not found on expected location C:\Dokumente >und Einstellungen\Administrator\Eigene >Dateien\Robotik\Projekte\C\Quattrokopter\Parabox\default\Parabox.elf" Dein Pfad enthält Leerzeichen, das
-
Thread
LPC1768 OpenOCD arm-none-eabi-gcc 5.3.0
flash 'lpc2000' found at 0x00000000 > flash write_image erase /home/pheinrich/workspace/netplug/Test/Debug/Test.elf auto erase enabled wrote 4096 bytes from file /home/pheinrich/workspace/netplug/Test/Debug/Test.elf
modify build tools on developer PC to inject correct LPC vector checksum. wrote 4096 bytes from file /home/pheinrich/workspace/netplug/Test/Debug/lpc_test2.axf in 0.309931s (12.906 KiB/s) > reset run JTAG tap: lpc17xx.cpu tap/device found: 0x4ba00477 (mfg: 0x23b, part: 0xba00, ver: 0x4) [/c]
-
Thread
toolchain für STM8 unter Windows
variable : 'ui8_value' main.c:534: warning 85: in function main unreferenced local variable : 'objects_readed' hex2bin -p 00 bin/main.ihx HEX TO BIN FILE CONVERTER V1.1 Copyright Raisonance S.A. 2004 ERROR: Cannot open the input file.make: *** [main] Error 1 X:\work>cd bin X:\work\bin>hex2bin
Hmm, jetzt stehe ich vor dem Problem, das hex-file zu flashen. Wenn ich das ihx-File im ST Visual Programmer öffnen will, kommen jede Menge Fehler, daß der Adressbereich nicht passt. Das stm8flash.exe Tool von https://github.com/tenbaht/sduino-windowstools
-
Thread
AvrStudio findet/macht keine elf mehr
sobald ich versuche ne Hex zu machen ("Build") kommt immer diese Fehlermeldung: gcc plug-in: Error: Object file not found on expected location C:\AVR\UART\default\uart.elf Diese Meldung ist auh berechtigt, da diese dort, und nirgendwo anders existiert. Was tun? Wollte das Programm nur mal testen, aber
*** [main.o] Error 1 Build succeeded with 2 Warnings... Message: gcc plug-in: Error: Object file not found on expected location C:\AVR\UART\default\uart.elf
-
Thread
cmake: Create a hex-file with an AVR compiler
.dir\link.txt --verbose=1 "C:\Program Files (x86)\CMake 2.8\bin\cmake.exe" -E remove -f CMakeFiles\cmTryCompileExec2122687935.dir/objects.a C:\WinAVR-20100110\bin\avr-ar.exe cr CMakeFiles\cmTryCompileExec2122687935.dir/objects.a @CMakeFiles\cmTryCompileExec2122687935.dir\objects1.rsp C:\WinAVR-20100110\bin\avr-gcc.exe -Wl,--whole-archive CMakeFiles\cmTryCompileExec2122687935.dir/objects.a -Wl,--no-whole-archive -o cmTryCompileExec2122687935
-
Thread
Verilog inout "NET "IIC_SDA_SFP" not found"
Hallo, ich versuche einen inout Port in Verilog zu nutzen. Im Constraints File habe ich ihn folgendermaßen angegeben: [vhdl]NET "IIC_SDA_SFP" LOC = "E6"; ## 4 on P2[/vhdl] In meinem Top Modul rufe ich ihn wie folgt auf: [vhdl]inout IIC_SDA_SFP,[/vhdl] Wenn ich es so
ConstraintSystem:59 - Constraint <NET "IIC_SDA_SFP" LOC = "E6";> [constraints.ucf(31)]: NET "IIC_SDA_SFP" not found. Please verify that: 1. The specified design element actually exists in the original design. 2. The specified object is spelled correctly in the constraint source file. Um das Modul
-
Thread
Xilinx ISE Pinzuordnung an Sparten 3E
ConstraintSystem:59 - Constraint <NET "led<0>" LOC = "M5" ;> [Basys2_100_250General.ucf(2)]: NET "led<0>" not found. Please verify that: 1. The specified design element actually exists in the original design. 2. The specified object is spelled correctly in the constraint source file. Als Package
ConstraintSystem:59 - Constraint <NET "led<0>" LOC = "M5" ;> [Basys2_100_250General.ucf(2)]: NET "led<0>" not found. Please verify that: 1. The specified design element actually exists in the original design. 2. The specified object is spelled correctly in the constraint source file. WARNING: ConstraintSystem
-
Thread
Kein Zugriff zum Programmer mit AVRDUDE unter Wine (Ubuntu 22.04)
i386. > > evtl. > sudo dpkg --add-architecture i386 > ? guifrmwrk.so: cannot open shared object file: No such file or directory
[code] ldd guifrmwrk.so linux-gate.so.1 (0xf7f1d000) libgtk-x11-2.0.so.0 => not found libgdk-x11-2.0.so.0 => not found libatk-1.0.so.0 => not found libgdk_pixbuf-2.0.so.0 => /lib/i386-linux-gnu/libgdk_pixbuf-2.0.so.0 (0xf7bcd000) libpangocairo
-
Thread
LCD Atmega8535 fehler beim Programm erstellen mit AVR-Studio
Fehlermeldungen habe ich wegbekommen, doch jetzt ist ein neuer Fehler aufgetaucht: gcc plug-in: Error: Object file not found on expected location M:\Mikrocontroller\lcd_chris\default\lcd_chris.elf Was muss ich jetzt machen. Muss ich an der lcd.c, die ich im Source-Files hinzugefügt habe noch was ändern,
> gcc plug-in: Error: Object file not found on expected location http://www.mikrocontroller.net/articles/WinAVR#gcc_plug-in:_Error:_Object_file_not_found_on_expected_location Alle Einstellarbeiten sollten nur in lcd.h gemacht
-
Thread
Scriptengine für zrtos
404 page not found.
namespace llvm; int main() { // llvm::InitializeNativeTarget(); // read byte-code from file auto Buffer = llvm::MemoryBuffer::getFile("./test.bc"); if (Buffer.getError()){ llvm::errs() << "test.bc not found\n"; return -1; } auto MemoryBuffer = Buffer.get
-
Thread
16x2 Modul UV-Belichter
Uv-Belichter nachzubauen > (http://www.endorphino.de/projects/electronics/belichter/index.html).Leider Object not found ..... Vielleicht so: http://www.endorphino.de/projects/electronics/belichter/index.html
Eberhard F. schrieb im Beitrag #3878078: > Object not found ..... Man... bist du pingelig... http://www.endorphino.de/projects/electronics/belichter/index.html War doch nur ein verunglückter cut-and-paste :-)
-
Thread
cannot read spec file 'device-specs/specs-atmega4808'
avr/lib/avrtiny/attiny40 + rm -rf autom4te.cache + aclocal ./bootstrap: 25: ./bootstrap: aclocal: not found + autoheader ./bootstrap: 26: ./bootstrap: autoheader: not found + autoconf ./bootstrap: 27: ./bootstrap: autoconf: not found + automake --foreign --add-missing --copy ./bootstrap: 28: .
autotools (autoconf, autoheader, automake, ...) installieren. > ./bootstrap: 25: ./bootstrap: aclocal: not found > + autoheader > ./bootstrap: 26: ./bootstrap: autoheader: not found > + autoconf > ./bootstrap: 27: ./bootstrap: autoconf: not found > + automake --foreign --add-missing --copy > ./bootstrap
-
Thread
HTerm unter Linux shared libaries problem
not found libXi.so.6 => not found libXrandr.so.2 => not found libXcursor.so.1 => not found libXfixes.so.3 => not found libpango-1.0.so.0 => not found libX11.so.6 => not found libgobject-2.0.so.0 => not found libgmodule-2.0.so.0 => not found libgthread-2.0.so.0 => not found libglib-2.0.so.0 => not found libXinerama.so.1 => not found libSM.so.6 => not found libpng12.so.0 => not found
-
Thread
Bibliothek mit Crosscompiler übersetzen
gcc... gcc checking whether the C compiler works... yes checking for C compiler default output file name... a.out checking for suffix of executables... checking whether we are cross compiling... no checking for suffix of object files... o checking whether we are using the GNU C compiler... yes
arm-linux-gnueabi-ranlib geht... dann sudo arm-linux-gnueabi-ranlib sudo: arm-linux-gnueabi-ranlib: command not found Wie sag ichs dem sudo?
-
Thread
Pi Pico mit VSCode debuggen
bin/arm-none-eabi-gdb: error while loading shared libraries: libncursesw.so.5: cannot open shared object file: No such file or directory Error: Unable to start GDB even after 5 seconds or it couldn't even start Make sure you can start gdb from the command-line and run any command like "echo hello".
arm-none-eabi-gdb: error > while loading shared libraries: libncursesw.so.5: cannot open shared > object file: No such file or directory aptitude install libncursesw5
-
Thread
C# mehrdimensionale Listen in Excel übertragen
//btnAEM.IsEnabled = true; } catch (System.IO.FileNotFoundException) { Console.WriteLine("Datei konnte nicht gefunden werden!"); } } } private void BtnWire_Click
btnAEM.IsEnabled = true; } catch (System.IO.FileNotFoundException) { Console.WriteLine("Datei konnte nicht gefunden werden!"); } }
-
Thread
Fehlermeldung
Compilieren möchte, der Compiler gibt mir aber immer zum Schluss diese Meldung aus. gcc plug-in: Error: Object file not found on expected location C:\Dokumente und Einstellungen\bklimmek\Eigene Dateien\GLCD_6100_Elektor\default\GLCD_6100.elf Kann damit von Euch jemand was anfangen? Mir eine Lösung liefern
Ich habe mal den Pfad gewechselt, Projektnamen getauscht usw., aber .... gcc plug-in: Error: Object file not found on expected location D:\Verschiedes_eigenes\AVR_Programme\6100_LCD_Elektor\default\6100_LCD_Elektor.elf @Wolfram > Compiliere testweise auf der Kommandozeile. ....mmmmmhhhhhh
-
Thread
DDR-RAM Spartan3E Starterkit nutzen
xst_vlog_bl2cl2/xst_vlog_bl2cl2/par/xst_vlog_bl2cl2.ucf(18)]: NET "infrastructure_top0/sys_clk_ibuf" not found. Please verify that: 1. The specified design element actually exists in the original design. 2. The specified object is spelled correctly in the constraint source file. ERROR:ConstraintSystem
xst_vlog_bl2cl2/xst_vlog_bl2cl2/par/xst_vlog_bl2cl2.ucf(23)]: NET "infrastructure_top0/wait_clk90" not found. Please verify that: 1. The specified design element actually exists in the original design. 2. The specified object is spelled correctly in the constraint source file. ERROR:ConstraintSystem
-
Thread
WinAVR mit Makefile erzeugt Fehler *.elf
Hallo, ich vresuche gerade mit einem vom Makefile erstelltem file, mein Project zu compilieren. Leider funktioniert das nicht so recht. Es kommt ständig die folgende Feherlmeldung: gcc plug-in: Error: Object file not found on expected location C:\testen\speichertest
http://www.mikrocontroller.net/articles/WinAVR#gcc_plug-in:_Error:_Object_file_not_found_on_expected_location
-
Thread
ESP32 - Fehler beim Kompilieren von c't Basecamp mit Asynctcp.h
Arduino\libraries\AsyncTCP-master\src\AsyncTCP.cpp:624:6: error: prototype for 'void AsyncClient::_dns_found(ip_addr_t*)' does not match any in class 'AsyncClient' void AsyncClient::_dns_found(ip_addr_t *ipaddr){ ^ In file included from C:\Users\Andreas\Documents\Arduino\libraries\AsyncTCP-master
::_s_dns_found(const char*, ip_addr_t*, void*)' does not match any in class 'AsyncClient' void AsyncClient::_s_dns_found(const char * name, ip_addr_t * ipaddr, void * arg){ ^ In file included from
-
Thread
Fehlermeldung von WinAVR
habe diese Fehlermeldung nach der Compilierung meines Programmes bekommen: "gcc plug-in: Error: Object file not found on expected location C:\Programme\Atmel\AVR-Programme\Test_1\default\Test_1.elf". Ich weiß nicht was der Compiler macht. Denn ich vermute das er eigentlich den Objektfile erstellen
error sollte doch ein zugriff auf das object file unterbrochen werden, oder!? gruß Benjamin
-
Thread
Spartan3E und SUMP.ORG Logic Analyser Probleme bei der Synthetisierung
: ConstraintSystem:59 - Constraint <NET "an<0>" LOC = "d14" |> [la.ucf(12)]: NET "an<0>" not found. Please verify that: 1. The specified design element actually exists in the original design. 2. The specified object is spelled correctly in the constraint source file. Grüße Wolfgang
site on the device. To bypass this error set the environment variable 'XIL_MAP_LOCWARN'. Error found in mapping process, exiting... Errors found during the mapping phase. Please see map report file for more details. Output files will not be written. Design Summary -------------- Number of
-
Thread
No Rule To Make Target?!
okay, nun habe ich das hier: gcc plug-in: Error: Object file not found on expected location D:\Eigene Dateien\Elektronikzeugs\Projekte\Netzteil\C\Netzteil.elf Make sure your makefile specifies the output .elf file as Netzteil.elf gcc plug-in: Error: Object file not found on expected location D:\Eigene Dateien\Elektronikzeugs\Projekte\Netzteil\C\Netzteil.elf Make sure your makefile specifies the output .elf file as Netzteil.elf Zwei Mal die gleiche
-
Thread
"undefined reference to" mit Makefile
und diese alle im selben Verzeichnis liegen, dann sollte folgendes im makefile stehen: # Target file name (without extension). TARGET = main # Object files directory # To put object files in current directory, use a dot (.), do NOT make # this an empty or blank macro! OBJDIR = .
# Object files directory # To put object files in current directory, use a dot (.), do NOT make # this an empty or blank macro! OBJDIR = ./obj Wobei das alles bei dir ja zu funktionieren scheint
-
Thread
#Include Anfänger Fragen
Settings mein externes Makefile geladen . Aber irgendwas mache ich noch falsch gcc plug-in: Error: Object file not found on expected location C:\Users\sbreuker\Documents\TestC.elf Make sure your makefile specifies the output .elf file as TestC.elf Wahrscheinlich ne Kleinigkeit - aber ich brauche
Mehrzahl der AVR Studio Benutzer dürfte ohne externes Makefile auskommen. > gcc plug-in: Error: Object file not found on expected location > C:\Users\sbreuker\Documents\TestC.elf Kann auch bedeuten, dass die Kompilierung nicht erfolgreich war. AVR Studio hat zusätzliche per Tabellenreiter aktivierbare
-
Thread
.elf Datei plug-in Error??
steht eigentlich in der *.elf Datei. Bei mir kommt immer eine Fehlermeldung: gcc plug-in: Error: Object file not found usw. Ich dachte die Datei wird von selbst angelegt und ich muss mich nicht darum kümmern. Weiß jemand Abhilfe. Vielen Dank im Vorraus Charly
. Hat vielleicht noch jemand einen Tip? hier noch mal die Fehlermeldung : gcc plug-in: Error: Object file not found on expected location D:\project-atmel\LCD ansteuerung\mit_C_11.9.7\default\display.elf mfg Robert
-
Thread
Problem bei LCD Ansteuerung
lcd-routines.h erstellt und in denselben Ordner getan. Jetzt bekomme ich die Meldung: gcc plug-in: Error: Object file not found on expected location J:\Dokumente und Einstellungen\M.Justinger\Desktop\LCD_Test\default\LCD_Test.elf Die Datei gibt es auch nicht, ich weis auch nicht was das für eine Datei ist
erstellt und in denselben Ordner getan. > Jetzt bekomme ich die Meldung: > > gcc plug-in: Error: Object file not found on expected location > J:\Dokumente und > Einstellungen\M.Justinger\Desktop\LCD_Test\default\LCD_Test.elf Punkt 1 Es ist in vielen Fällen unklug, in Dateinamen Dinge wie Leerzeichen