-
Thread
Arduino mit Java Applet über Webserver steuern
sieht wie folgt aus: <!DOCTYPE html> <html> <head> <meta charset="utf8" /> <title>File Javaapplet</title> </head> <body> <object type="application/x-java-applet;version=1.4.1" name="jsap" id="jsap" width="500" height="600"> <param name="archive" value="FileApplet.jar"> <param name="code" value="FileApplet"> <param name="mayscript" value="yes"> <param name="scriptable" value="true"> </object> </body> </html> Über einen Lösungsvorschlag würde ich mich rießig freuen.
-
Thread
google test installieren wíndows 10
++.exe - skipped -- Detecting CXX compile features -- Detecting CXX compile features - done -- Found Python: H:/Apps/Python/Python38-32/python.exe (found version "3.8.5") found components: Interpreter -- Configuring done -- Generating done -- Build files have been written to: C:/MinGW/googletest
build [/code] beim make bekomme ich dann aber den Fehler [code] $ make [ 12%] Building CXX object googletest/CMakeFiles/gtest.dir/src/gtest-all.cc.obj In file included from C:/MinGW/googletest/googletest/include/gtest/gtest-message.h:55, from C:/MinGW/googletest/googletest/include
-
Thread
PowerShell: Get-ChildItem stürzt ab
clip-duration.ps1:10 Zeichen:5 + Get-ChildItem -LiteralPath $targetDirectory -Include $filter -Fil ... + ~~~~~~~~~~~~~~~~~~~~~~~~~~~~~~~~~~~~~~~~~~~~~~~~~~~~~~~~~~~~~~~~~ + CategoryInfo : ObjectNotFound: (C:\Users\rudi\*.mp4:String) [Get-ChildItem], ItemNotFoundException + FullyQualifiedErrorId : PathNotFound,Microsoft.PowerShell.Commands.GetChildItemCommand [/pre] Offenbar versucht Get-ChildItem auch noch C:\Users\rudi zu iterieren und fällt dabei auf die Fresse. Warum? Wie kann man diesen Unsinn
-
Thread
Transistortester AVR
Hello I found a bug in Makefile. There is ANZ_MESS define but in code there is ANZ_MES, so this define is not working correctly.
I would say the problem is the file GetESR.S not the makefile.
-
Artikel
WinAVR
Autoexec.Bat (Windows 98SE) bzw. in der Systemsteuerung (Windows XP, 2000) anzupassen. gcc plug-in: Error: Object file not found on expected location. Diese Fehlermeldung kann nur auftauchen, wenn der GNU C Compiler aus dem AVR-Studio heraus bedient wird. Dass keine weiteren Fehlerursachen genannt werden, ist
dem Programmers Notepad heraus) und auf Fehlermeldungen achten. Siehe auch: gcc plug-in: Error: Object file not found... im Forum avr-gcc: _spawnvp: No such file or directory. > "make.exe" all -------- begin -------- avr-gcc (GCC) 4.1.1 (WinAVR 20070122) Copyright (C) 2006 Free Software Foundation,
-
Thread
Horizon EDA [War: Neues, halbfertiges Elektronik-CAD-Programm]
unit.cpp:1: /usr/local/lib/gcc5/gcc/x86_64-portbld-freebsd10.0/5.3.0/include-fixed/stdlib.h:127:3: note: 'strtold' strtold(const char * __restrict, char ** __restrict); ^ In file included from pool/unit.cpp:3:0: ./json.hpp: In member function 'float nlohmann::basic_json<ObjectType, ArrayType
not declared in this scope GtkFileChooserNative *native = gtk_file_chooser_native_new ("Save PDF", ^ imp/imp_schematic.cpp:123:25: error: ‘native’ was not declared in this scope GtkFileChooserNative
-
Thread
Angstrom distribution für ICnova ADB4000 kompilieren
local.conf DEBUG: CONF conf/bitbake.conf:656: including conf/build/x86_64-linux.conf DEBUG: CONF file 'conf/build/x86_64-linux.conf' not found DEBUG: CONF conf/bitbake.conf:657: including conf/target/INVALID-oe-linux.conf DEBUG: CONF file 'conf/target/INVALID-oe-linux.conf' not found DEBUG: CONF conf/bitbake.conf:658: including conf/machine/adb4000.conf DEBUG: CONF file 'conf/machine/adb4000.conf' not found DEBUG: CONF conf/bitbake.conf:659: including conf/machine-sdk/${SDKMACHINE}.conf DEBUG: CONF file 'conf/machine-sdk/${SDKMACHINE}.conf' not found DEBUG: CONF
-
Thread
FFT auf dem stm32f411RE TrueStudio
libarm_cortexM4lf_math.a" als library hinzuzufügen führt dazu, dass wenn ich auf debug drücke die Meldung: "Program file does not exist D:\Workspace A\FFTandLED\Debug\FFTandLED.elf not found D:\Workspace A\FFTandLED\Debug\FFTandLED.elf not found D:\Workspace A\FFTandLED\Debug\FFTandLED.elf not found" erscheint.
Project->Properties->C/C++ Build->Settings->Tool settings->C Linker->Miscelaneous->Additional object files hinzufügen. Harry
-
Thread
KI Modellzoo
: { "command": "bash -c \"pwd\"" } } } } Error: Tool run_shell_command not found [/code] Der Agent oder auch der Chat kann keine Shell-Kommandos ausführen.
with a listed tool, use it rather than guessing. 9. Do not perform actions with hypothetical files. Use tools to find relevant files.
-
Thread
ENC28J60 Basics[Beispielprogramm in AVRGCC für atmega8]
directory G:\uC\enc\default\ gcc plug-in: Error: Object file not found on expected location G:\uC\enc\enc.elf Make sure your makefile specifies the output .elf file as enc.elf gcc plug-in: Error: Object file not found on expected location G:\uC\enc\enc.elf Make sure your makefile specifies the output .elf file as enc.elf gcc plug-in: Error: Object file not found on expected location G:\uC\enc\enc.elf Make sure your makefile specifies the output .elf file as enc.elf [/pre] Ich benutze, wie man sieht
-
Thread
stk500 testprogramm
elf Datei erzeugt werden. Ich fange langsam an zu verzweifeln. der fehler ist "gccplug in:error:Object file not found on expected location......stk500_testprogramm.elf" Manchmal erzeugt mein avr diese elf und oft aber auch nicht. Wäre super wenn Du mir weiter helfen könntest.
> der fehler ist "gccplug in:error:Object file not found on expected > location......stk500_testprogramm.elf" Wenn ich diese Fehlermeldung habe, dann habe ich normalerweise einen C-Syntaxfehler. Scrolle doch mal im Ausgabefenster etwas
-
Thread
friendlyarm toolchain
: not found
exec: /home/kay/local/arm/4.4.3/bin/opt/FriendlyARM/toolschain/4.4.3/bin/.arm-none-linux-gnueabi-gcc: not found
-
Thread
Pollin - Receiver-Mainboard mit Twin DVB-[T,C] Tuner, NXP PNX8950EH
...<\r><\n> +TmLoadDspImageDefault() Image='\Windows\phStbRootApp.mi'<\r><\n> TmLoadDspImageFromFile: '\Windows\phStbRootApp.mi'<\r><\n> DSP image file '\Windows\phStbRootApp.mi' not found!<\r><\n> Hynix, 8bit, 64MB<\r><\n> DSP Image found<\n><\r><\n> Trying to load DSP Image from flash<\r><\n>
...<\r><\n> +TmLoadDspImageDefault() Image='\Windows\phStbRootApp.mi'<\r><\n> TmLoadDspImageFromFile: '\Windows\phStbRootApp.mi'<\r><\n> DSP image file '\Windows\phStbRootApp.mi' not found!<\r><\n> Hynix, 8bit, 64MB<\r><\n> DSP Image found<\n><\r><\n> Trying to load DSP Image from flash<\r><\
-
Thread
Speicherbedarf Mp3-Player
Fehlermeldung? Es wurde auch keine .hex-Datei zum Programmieren erstellt. gcc plug-in: Error: Object file not found on expected location C:\User\....\default\MP3.elf Der Code compilierte ohne Probleme. [c]int main (void){ FATFS *fs; // Work area (file system object) for logical drives FIL fsrc, fdst; // file objects BYTE buffer[4096]; // file copy buffer FRESULT res; // FatFs function common result code UINT br, bw; // File R/W count //
-
Thread
Belichten von Platinen mit CNC-Fräse + UV-Laser
Der erste Fehler: "No tools found". [code] $ python gbr2laser.py What do you want to calculate: 1: Perimeter + filling 2: Only filling 3: Only perimeter (default 1) Gerber-File as input(default GerberTest.gbr) ngc-File
Y/N (default N) Filling bidirectional Y/N (default N) Import tools GerberTest.gbr No tools found! IllegalArgumentException: Operation not supported by GeometryCollection Traceback (most recent call last): File "gbr2laser.py", line 1286, in <module> geometry = cascaded_union(geometry
-
Thread
Genesys 2 (Xilinx Kintex 7): Audio-Codec Implementierung und Filteranbindung
Jetzt habe ich noch zusätzliche Board-Files hinzugefügt. https://reference.digilentinc.com/reference/software/vivado/board-files. Die Warning: [Board 49-67] The board_part definition was not found for ... hat sich nun auch erledigt
! Muss ich da noch was installieren? >>> import serial Traceback (most recent call last): File "<stdin>", line 1, in <module> ModuleNotFoundError: No module named 'serial' Ich sollte wohl noch einen Texteditor für Python installieren? Habs einfach hier heruntergeladen: https://www.python.org
-
Thread
HID Gerät Ansprechen
wirklich verstehe. Es scheint so als würde ich keinen Handle bekommen jedenfalls schlägt CreateFile immer mit error-code 3 fehl also ERROR_PATH_NOT_FOUND. Das passiert aber nur wenn ich vorher SetupDiDestroyDeviceInfoList aufrufe. wenn ich SetupDiDestroyDeviceInfoList nicht aufrufe schlägt CreateFile
} } } SetupDiDestroyDeviceInfoList(hDevInfo); DeviceHandle = CreateFile((LPCTSTR)pspdidd->DevicePath,GENERIC_READ | GENERIC_WRITE,FILE_SHARE_READ | FILE_SHARE_WRITE,NULL,OPEN_EXISTING,FILE_FLAG_OVERLAPPED,NULL); printf("\n8. %d",GetLastError()); HidD_GetAttributes
-
Thread
Arduino+AD9833 code für Rechteckfestfrequenz
should have received a copy of * the GNU General Public License along with this program. * If not, see <http://www.gnu.org/licenses/>. * * This example code is in the public domain. * * Library code found at: https://github.com/Billwilliams1952/AD9833-Library-Arduino * */ #include
library #define FNC_PIN 4 // Can be any digital IO pin //--------------- Create an AD9833 object ---------------- // Note, SCK and MOSI must be connected to CLK and DAT pins on the AD9833 for SPI AD9833 gen(FNC_PIN); // Defaults to 25MHz internal reference frequency void setup() {
-
Thread
AVR Eclipse Plugin 2.3
Eclipse beim öffnen der Projekteinstellungen [Project->Proporties] mit einer Fehlermeldung abbrach [Object in XY not found ..] Werde mal versuchen das ganze nachvollziehbar zu machen bis bald...
CDT und dessen Dialogen? Wenn ich in den Dialogen auf das Fragezeichen klick kommt meist nur "Topic not found" (oder so ähnlich). Grüße, Chris
-
Thread
AP7000 und ICnova ADB1000: Bisschen wenig?
Auch basicdrawing meldet sich wie folgt: # basicdrawing QWSSocket::connectToLocalFile could not connect:: Connection refused QWSSocket::connectToLocalFile could not connect:: Connection refused QWSSocket::connectToLocalFile could not connect:: Connection refused QWSSocket::connectToLocalFile could not connect:: Connection refused QWSSocket::connectToLocalFile could not connect:: Connection refused QWSSocket::connectToLocalFile could not connect:: Connection refused No Qt for Embedded Linux server
-
Thread
FAT Directory scrollen
---------------------- res = dir_read(dp, 0); // Read an item if (res == FR_NO_FILE) { // Reached end of directory dp->sect = 0; res = FR_OK; } if (res == FR_OK) { // A valid entry is found get_fileinfo(dp, fno); // Get the object
ohen immer wieder die FAT auslesen zu muessen. Ich habe damit locker durch ein Vereichnis mit LFN File descriptors durchscrollen koennen. (Zugegebenermassen allerdings mit einem up/down button, nicht mit Mausrad oder ähnlichem, da wäre definitiv eine höhere Performance von Nöten)
-
Thread
Software zum Steuern des Türschlossantrieb "eqiva eQ-3 Bluetooth Smart Lock"
Ich hab mich dann mit dem AP verbunden: [E][WebServer.cpp:633] _handleRequest(): request handler not found [E][WebServer.cpp:633] _handleRequest(): request handler not found [E][WebServer.cpp:633] _handleRequest(): request handler not found [E][WebServer.cpp:633] _handleRequest(): request handler not found [E][WebServer.cpp:633] _handleRequest(): request handler not found [E][WebServer.cpp:633] _handleRequest(): request handler not found # WIFI: connected to SSiD: XNetz # WIFI: connected! #
-
Thread
AVR-Projekt kompilieren
gefunden. [INFO] : Begin compilation of project "Chameleon-RevG"... make: avr-gcc: No such file or directory make: *** [../LUFA/Build/lufa_build.mk:237: build_begin] Fehler 127
den Vorgang. In Zeile:1 Zeichen:1 + avr-gcc --version + ~~~~~~~ + CategoryInfo : ObjectNotFound: (avr-gcc:String) [], CommandNotFoundException + FullyQualifiedErrorId : CommandNotFoundException
-
Thread
Plugin Fehler bei AVR-Studio und GCC
Loaded Plugin STK500 Loaded Plugin AVR GCC Loaded Partfile c:\...ATMega128.xml gcc plug-in: Error: Object file not found on expected location c:\....elf Weiss jemand was das ist ? Ein Obejctfile kann es noch gar nicht geben, der Compiler ist ja noch nicht gestartet.... Greets Karlheinz
Moment sogar schon fertig. Es hat aber beim Compilieren offenbar einen Fehler gegeben, weshalb kein Object-File erzeugt wurde, weshalb der Linker meckert...
-
Thread
Turbo51 - Free Pascal compiler for 8051
, Intel HEX, OMF-51 and assembler source. Source level debugging possible with extended absolute object file. Give it a try!
specific features. After I will finish it I will reconsider a compiler for AVR. But the AVR future is not clear now. Read this information: http://www.atmel.com/corporate/documents/SLL_Customer_Letter.pdf http://www.atmel.com/dyn/corporate/view_detail.asp?FileName=Micro_ON_10_2.html
-
Thread
TCP/IP Stack Micrchip EEPROM Includen
you need to edit TCPIPConfig.h and disable this stack feature. The linker error tells you which object file this error was generated from. It should be a clue as to what feature you need to disable."
" Leider sagt mir das nichts über das Object file aus oder was auch immer ich in der TCPIP.h ändern muss. Das EEPROM_CS_TRIS et. habe ich ja bereits in der HWP EX16_MRF24W XC16.h definiert!
-
Thread
Cyclone V - Altera SoC - Linux und QT auf einem SoCrates
. Wenn ich allerdings die Files „socfpga_socrates.dtb“ und uImage durch die neu erzeugten Files austausche erhalte ich folgenden Auszug: U-Boot SPL 2013.01.01 (Aug 04 2015 - 21:24:12) BOARD: EBV SoCrates CLOCK: EOSC1 clock 25000
registered as minor 0 [ 1.785306] brd: module loaded [ 1.789374] cadence-qspi ff705000.spi: DMA NOT enabled [ 1.794574] cadence-qspi ff705000.spi: master is unqueued, this is deprecated [ 1.802217] m25p80 spi2.0: n25q256a (32768 Kbytes) [ 1.807245] 6 ofpart partitions found on MTD device
-
Thread
Problem beim compiliren der avr-libc-1.7.1
checking for avr-gcc... avr-gcc checking whether we are cross compiling... yes checking for suffix of object files... configure: error: in `/tmp/avr-libc-1.7.1': configure: error: cannot compute suffix of object files: cannot compile See `config.log' for more details [/code] Die config.log ist im Anhang
libexec/gcc/avr/4.6.0/cc1: error while loading shared libraries: libmpc.so.2: cannot open shared object file: No such file or directory [/pre] Dein compilierter AVR-GCC verlässt sich auf eine shared lib, die nicht gefunden wird. Eventuell musst du LD_LIBRARY_PATH entsprechend setzen.
-
Thread
Mehrere FTDI´s (FT232) an einem Rechner identifizieren?
Resources/Utilities/FT_Prog.zip http://www.ftdichip.com/Resources/Utilities/FT_PROG_README.TXT NOTE 1: Editing the driver for your new identity will invalidate any current driver certification. NOTE 2: It will be necessary for you to maintain your own edited driver release for distribution to
; } while (USBState != eFTstate.CONNECTED); } else { // Did not found any FT232. There is nothing to program! MessageBox.Show ("Found no FT232 chip to configure!", Application.ProductName, MessageBoxButtons.OK, MessageBoxIcon.Error
-
Thread
C# und ECMD Befehl über IP Stack an Ethersex absetzen
RuntimeAssembly assembly, String[] args) at System.AppDomain.ExecuteAssembly(String assemblyFile, Evidence assemblySecurity, String[] args) at Microsoft.VisualStudio.HostingProcess.HostProc.RunUsersAssembly() at System.Threading.ThreadHelper.ThreadStart_Context(Object state)
RuntimeAssembly assembly, String[] args) at System.AppDomain.ExecuteAssembly(String assemblyFile, Evidence assemblySecurity, String[] args) at Microsoft.VisualStudio.HostingProcess.HostProc.RunUsersAssembly() at System.Threading.ThreadHelper.ThreadStart_Context(Object state)
-
Thread
selbstgebauter avr-gcc findet avr-libc nicht
sollte: hier die Erklärung für Johanns Analyse: [pre] configure:3713: checking for suffix of object files configure:3735: avr-gcc -c conftest.c >&5 /tmp/ccpQbjTL.s: Assembler messages: /tmp/ccpQbjTL.s:13: Error: too many memory references for `in' /tmp/ccpQbjTL.s:14: Error: too many memory
error: in `/home/pas/gcc-avr/avr-libc-1.8.1/build': configure:3755: error: cannot compute suffix of object files: cannot compile[/pre] Insbesondere die letzte Meldung "cannot compute suffix of object files" sollte beim Wühlen in der allwissenden Müllhalde zahlreiche Treffer zutage fördern. Weiters