[C-Control 1] ccsdk compilieren - error

Gast #1401826
Lesenswert?
• ▲
▼
Hallo Programmierer, wie kann ich das Problem beheben?

http://www.ccsdk.de/ccsdk/cc1-linux-sdk-0.2.6.1.tar.bz2
1
make[1]: Entering directory `/home/user/ccsdk-0.2.6.1/ccbasic'
2
g++ -O2 -g -Wall   -c alias.cpp
3
alias.cpp: In member function ‘void CAlias::Define(const char*, long int)’:
4
alias.cpp:39: error: ‘strdup’ was not declared in this scope
5
alias.cpp: In member function ‘CAlias* CAliasList::Find(const char*)’:
6
alias.cpp:94: error: ‘strcmp’ was not declared in this scope
7
make[1]: *** [alias.o] Error 1

Antwort schreiben

Hinweis: der ursprüngliche Beitrag ist mehr als 6 Monate alt. Bitte hier nur auf die ursprüngliche Frage antworten, für neue Fragen einen neuen Beitrag erstellen.

Formatierung
  • [c]C-Code[/c]
  • [code]Code in anderen Sprachen, ASCII-Zeichnungen[/code]
  • [math]Formel in LaTeX-Syntax[/math]
  • [[Titel]] – Link zu einem Artikel
  • Verweis auf einen anderen Beitrag: Rechtsklick auf dessen Beitrags-ID (#8078628), „Adresse kopieren“, in den Text einfügen

Mehr zur Formatierung

Längeren Sourcecode als Anhang, nicht in den Text. JPG nur für Fotos und Scans; Zeichnungen und Screenshots als PNG oder GIF. Siehe Bildformate.

Schon registriert? Anmelden

Wird nicht angezeigt. Wir schicken dir einen Link; sobald du damit bestätigst, erscheint dein Beitrag.

Mit dem Abschicken legst du einen kostenlosen Account an und erkennst die Nutzungsbedingungen und die Datenschutzerklärung an.