Gast
#164882
Hallo und allseits einen schönen Abend, Zum Erstellen von avrdude4.4.0 unter MacOSX gebe ich folgendes ein: ./configure make Dabei tritt folgende Fehlermeldung auf: texi2dvi test -f 'avrdude.text' || echo './'avrdude.texi fflush error on stdout /usr/bin/texi2dvi: line599: tex: command not found /usr/bin/texi2dvi: tex exited with bad status, quitting. /usr/bin/texi2dvi: see avrdude.log for errors. make[2]: *** [avrdude.dvi] Error 1 make[1]: *** [all-recursive] Error 1 make: *** [all] Error 2 Kann mir jemand helfen? Danke. leo