Fehlermeldungen (bei mehreren funktionierende Programmen)

OP #3484051
Lesenswert?
• ▲
▼
Hallo,
brauche wieder mal eure Hilfe.
Mehrere Programme, auch die ich bereits getestet habe und auch 
funktionierten, wollen sich nicht mehr kompilieren lassen.
Leider gibt's eine Fehlermeldungen, die ich nicht ganz verstehe woher 
diese jetzt auf einmal kommt. Jetzt meckert immer die "util/delay", habe 
dieser aber kein Haar gekrümmt!
Vielleicht hat jemand einen gut Tipp parat?
Danke Mad

Fehlermeldungen:
1
     
2
0 [main] sh 1932 sync_with_child: child 2744(0x14C) died before initialization with status code 0xC0000142
3
  24305 [main] sh 1932 sync_with_child: *** child state waiting for longjmp
4
/usr/bin/sh: fork: Resource temporarily unavailable
5
rm -rf ADW_PWM_fuer_LED.o LCD_DRV.o LCD_TEXT.o  ADW_PWM_fuer_LED.elf dep/* ADW_PWM_fuer_LED.hex ADW_PWM_fuer_LED.eep ADW_PWM_fuer_LED.lss ADW_PWM_fuer_LED.map
6
make: [clean] Error -1073741502 (ignored)
7
Build succeeded with 0 Warnings...
8
      0 [main] sh 4036 sync_with_child: child 5024(0x14C) died before initialization with status code 0xC0000142
9
  80897 [main] sh 4036 sync_with_child: *** child state waiting for longjmp
10
/usr/bin/sh: fork: Resource temporarily unavailable
11
avr-gcc  -mmcu=atmega32 -Wall -gdwarf-2 -std=gnu99 -Os -funsigned-char -funsigned-bitfields -fpack-struct -fshort-enums -MD -MP -MT ADW_PWM_fuer_LED.o -MF dep/ADW_PWM_fuer_LED.o.d  -c  ../ADW_PWM_fuer_LED.c
12
In file included from ../definition.h:15,
13
                 from ../ADW_PWM_fuer_LED.c:18:
14
c:/winavr-20080411/lib/gcc/../../avr/include/util/delay.h: In function '_delay_us':
15
c:/winavr-20080411/lib/gcc/../../avr/include/util/delay.h:112: error: expected expression before ')' token
16
c:/winavr-20080411/lib/gcc/../../avr/include/util/delay.h: In function '_delay_ms':
17
c:/winavr-20080411/lib/gcc/../../avr/include/util/delay.h:145: error: expected expression before ')' token
18
c:/winavr-20080411/lib/gcc/../../avr/include/util/delay.h:155: error: expected expression before ')' token
19
../ADW_PWM_fuer_LED.c: In function 'main':
20
../ADW_PWM_fuer_LED.c:53: warning: implicit declaration of function 'lcd_init'
21
../ADW_PWM_fuer_LED.c:62: warning: implicit declaration of function 'AD_Werte'
22
make: *** [ADW_PWM_fuer_LED.o] Error 1
23
Build failed with 3 errors and 2 warnings...

Antwort schreiben

Hinweis: der ursprüngliche Beitrag ist mehr als 6 Monate alt. Bitte hier nur auf die ursprüngliche Frage antworten, für neue Fragen einen neuen Beitrag erstellen.

Formatierung
  • [c]C-Code[/c]
  • [code]Code in anderen Sprachen, ASCII-Zeichnungen[/code]
  • [math]Formel in LaTeX-Syntax[/math]
  • [[Titel]] – Link zu einem Artikel
  • Verweis auf einen anderen Beitrag: Rechtsklick auf dessen Beitrags-ID (#8078628), „Adresse kopieren“, in den Text einfügen

Mehr zur Formatierung

Längeren Sourcecode als Anhang, nicht in den Text. JPG nur für Fotos und Scans; Zeichnungen und Screenshots als PNG oder GIF. Siehe Bildformate.

Schon registriert? Anmelden

Wird nicht angezeigt. Wir schicken dir einen Link; sobald du damit bestätigst, erscheint dein Beitrag.

Mit dem Abschicken legst du einen kostenlosen Account an und erkennst die Nutzungsbedingungen und die Datenschutzerklärung an.