Gast
#283267
Hab grad gemerkt ich hab im Falschen Forum geposted. Ich hoffe hier auf
hilfe.
Hallo,
Ich habe versucht in den Code der IP-Cam einen Watchdog einzubauen,
der
aber nicht funktioniert. Im anhang ist das original und das geänderte
main.c und main.h. Bitte schaut es euch mal an.
Beim Compilen kommt folgender Fehler:
-------------------
main.c:1: error: stray '\239' in program
main.c:1: error: stray '\187' in program
main.c:1: error: stray '\191' in program
make.exe: *** [main.o] Error 1
> Process Exit Code: 2
-------------------