Problem beim Build mit AtmelStudio6

OP #3101126
Lesenswert?
• ▲
▼
Hallo,

ich habe ein Problem mit dem AtmelStudio6.

Ich arbeite gerade an einem Projekt, Ornder- und Projektname im Studio 
0023_v1. Es gibt derzeit nur eine C-Datei für den Quelltext, 0023_v1.c

Wurde schon mehrfach übersetzt und in den Controller geladen. Ohne 
Probleme. Seit kurzem bricht das Studio jedoch beim Built ab. Ausgabe 
siehe unten.

Das komische:
Wenn ich ein neues Projekt mit anderem Name erstelle und den Quelltext 
hineinkopiere, geht es ohne Probleme. Es läuft nur nicht, wenn ich den 
Name 0023_V1 verwende. Ich habe das Projekt 0023_v1 auch schon komplett 
von der Festplatte gelöscht und ein neues Projekt mit dem Namen erstellt 
(im gleichen Verzeichnis) - es geht nicht mehr. Selbst wenn ich ein 
neues Projekt 0023_v1 erstelle und den Queltext nicht hineinkopiere - 
sondern nur eine while-Schleife die nichts tut - es geht nicht mehr.

Kann es sein, dass es hier mal eine Fehler gab und im 
Programmverzeichnis vom Atmel Studio da noch irgend etwas steht. Im 
Projektverzeichnis kann ja nichts mehr falsch sein, da schon mehrfach 
gelöscht und wieder neu angelegt.

Einen anderen Projektnamen möchte ich eigentlich nicht verwenden, da in 
dem Zahlenwirrwar ein System drinnen ist.


Hier die Ausgabe vom Studio


------ Build started: Project: 0023_v1, Configuration: Debug AVR ------
Build started.
Project "0023_v1.cproj" (default targets):
Target "PreBuildEvent" skipped, due to false condition; 
('$(PreBuildEvent)'!='') was evaluated as (''!='').
Target "CoreBuild" in file "C:\Program Files (x86)\Atmel\Atmel Studio 
6.0\Vs\Compiler.targets" from project 
"S:\Firmware\0023_v1\0023_v1\0023_v1.cproj" (target "Build" depends on 
it):
  Using "RunCompilerTask" task from assembly "C:\Program Files 
(x86)\Atmel\Atmel Studio 6.0\Vs\Compiler.Task.dll".
  Task "RunCompilerTask"
    C:\Program Files (x86)\Atmel\Atmel Studio 6.0\make\make.exe all
    make: makefile: No such file or directory
    make: *** No rule to make target `all'.  Stop.
  Done executing task "RunCompilerTask" -- FAILED.
Done building target "CoreBuild" in project "0023_v1.cproj" -- FAILED.
Done building project "0023_v1.cproj" -- FAILED.

Build FAILED.
========== Build: 0 succeeded or up-to-date, 1 failed, 0 skipped 
==========

Antwort schreiben

Hinweis: der ursprüngliche Beitrag ist mehr als 6 Monate alt. Bitte hier nur auf die ursprüngliche Frage antworten, für neue Fragen einen neuen Beitrag erstellen.

Formatierung
  • [c]C-Code[/c]
  • [code]Code in anderen Sprachen, ASCII-Zeichnungen[/code]
  • [math]Formel in LaTeX-Syntax[/math]
  • [[Titel]] – Link zu einem Artikel
  • Verweis auf einen anderen Beitrag: Rechtsklick auf dessen Beitrags-ID (#8078628), „Adresse kopieren“, in den Text einfügen

Mehr zur Formatierung

Längeren Sourcecode als Anhang, nicht in den Text. JPG nur für Fotos und Scans; Zeichnungen und Screenshots als PNG oder GIF. Siehe Bildformate.

Schon registriert? Anmelden

Wird nicht angezeigt. Wir schicken dir einen Link; sobald du damit bestätigst, erscheint dein Beitrag.

Mit dem Abschicken legst du einen kostenlosen Account an und erkennst die Nutzungsbedingungen und die Datenschutzerklärung an.