-
Thread
Rust - ist das hier um zu bleiben?
dauert: [pre] cargo check check - Analyze the current package and report errors, but don't build object files [/pre] Warum die Zeiten so lang sind, kann man hier lesen: The Rust Compilation Model Calamity https://pingcap.com/blog/rust-compilation-model-calamity
installieren $ ./A.elf ./A.elf: error while loading shared libraries: libgreeter.so: cannot open shared object file: No such file or directory $ cp hallo/libgreeter.so . # hallo greeter installieren $ ./A.elf Hello World! $ cp geburtstag/libgreeter.so . # hallo greeter ersetzen mit geburtstag greeter
-
Thread
STM32F103 "Blue Pill" USB Bootloader Linux
heavily modified "Default linker script for STM32F10x_512K_64K" Copyright RAISONANCE S.A.S. 2008 found in the STM fw-library. (there is not much left from Raisonance's code and nearly everything has been modified or reordered) */ /* Program Entry, set to mark it as "used" and avoid gc */ ENTRY
Stack_Init = _estack - __Stack_Size ; /*"PROVIDE" allows to easily override these values from an object file or the commmand line.*/ PROVIDE ( _Stack_Init = __Stack_Init ) ; [/c] Was müsste ich jetzt da ändern um mit dem USB-Bootloader klarzukommen? Grüße, Martin
-
Thread
16-Bit-EXE erzeugen
virtuelle Maschine aufzusetzen. Auf einer 16-Bit-Maschine soll einfach der Text: "Error - could not run application - Media data not found)" über stdout oder stderr (ist tatsächlich egal) ausgegeben und der Rückgabewert 1 erzeugt werden.
mov r0, #1 mov r7, #__NR_exit svc #0 .size _start, .-_start .type message, %object message: .ascii "Error - could not run application - Media data not found)!\r\n" message_end = . .size message, message_end-message[/code] Im Anhang das Kompilat als ELF.
-
Thread
ESP32 - Fehler beim Kompilieren von c't Basecamp mit Asynctcp.h
Arduino\libraries\AsyncTCP-master\src\AsyncTCP.cpp:624:6: error: prototype for 'void AsyncClient::_dns_found(ip_addr_t*)' does not match any in class 'AsyncClient' void AsyncClient::_dns_found(ip_addr_t *ipaddr){ ^ In file included from C:\Users\Andreas\Documents\Arduino\libraries\AsyncTCP-master
::_s_dns_found(const char*, ip_addr_t*, void*)' does not match any in class 'AsyncClient' void AsyncClient::_s_dns_found(const char * name, ip_addr_t * ipaddr, void * arg){ ^ In file included from
-
Thread
Konrad KA3005 unter Linux ansteuern
stripped /opt/korad$ ldd korad linux-vdso.so.1 => (0x00007ffff255d000) libqwt.so.6 => not found libQt5Widgets.so.5 => not found libQt5Gui.so.5 => not found libQt5SerialPort.so.5 => not found libQt5Core.so.5 => not found libGL.so.1 => not found
auch schön, warum ldd bei unbekannten Binaries unsicher ist): [code] /opt/korad$ LD_TRACE_LOADED_OBJECTS= ./lib/ld-linux-x86-64.so.2 ./bin/korad_real linux-vdso.so.1 => (0x00007fffccef1000) libqwt.so.6 => not found libQt5Widgets.so.5 => not found libQt5Gui.so.5 =>
-
Thread
EleLa - Elektronik Lagerverwaltung V3.1
I try to change scale factor in ini file, scale is changed, but overlap not changed. My os is Ubuntu 20.04.
Here the files for EleLa V4.0 english and russia. But the translation is now not complete, the most texts are translated.
-
Thread
GPS Koordinaten händisch in die EXIF Daten eines Fotos eingeben
Start von digikam nur [code] digikam(6002)/kdeui (KIconLoader): Error: standard icon theme "oxygen" not found! Object::connect: No such signal org::freedesktop::UPower::DeviceAdded(QDBusObjectPath) Object::connect: No such signal org::freedesktop::UPower::DeviceRemoved(QDBusObjectPath) QSqlDatabasePrivate
::Private::loadSequence: Invalid pixmap specified. digikam(6002) KXMLGUIClient::loadStandardsXmlFile: ui/ui_standards.rc not found in ("/home/dirk/.kde/share/config/", "/etc/kde4/", "/usr/share/kde4/config/") QFSFileEngine::open: No file name specified !!!!!!! ERROR !!!!!!! - KHTML default stylesheet
-
Thread
Lagerverwaltung Part-DB V0.5.x
Daten\htdocs\Part-DB>C:\PHP\php.exe composer.phar dump-autoload -o Generating optimized autoload files [/c] Es funktioniert noch immer nicht. Immer noch der selbe Fehler 'PartDB\\Database' not found
*1 FastCGI sent in stderr: "PHP message: PHP Fatal error: Uncaught Error: Class 'PartDB\Database' not found in /config/www/PartDB/inc/lib.start_session.php:286 Stack trace: #0 [internal function]: exception_handler(Object(Error)) #1 {main} thrown in /config/www/PartDB/inc/lib.start_session.php
-
Thread
texane ST-Link geht schief---> makefile fehler
C object CMakeFiles/stlink-static.dir/src/sg.c.o [ 14%] Building C object CMakeFiles/stlink-static.dir/src/logging.c.o [ 17%] Building C object CMakeFiles/stlink-static.dir/src/flash_loader.c.o [ 20%] Linking
C object CMakeFiles/stlink-static.dir/src/sg.c.o [ 16%] Building C object CMakeFiles/stlink-static.dir/src/logging.c.o [ 20%] Building C object CMakeFiles/stlink-static.dir/src/flash_loader.c.o [ 23%] Linking
-
Thread
Arduino - UNO Flashershield (Linux)
open shared object file: No such file or directory Ein libtermcap* habe ich in /lib/x86_64-linux-gnu nicht gefunden und auch unter /lib nicht.
usr/local/bin/flashershield: ELF: not found /usr/local/bin/flashershield: 2: /usr/local/bin/flashershield: �: not found /usr/local/bin/flashershield: 3: /usr/local/bin/flashershield: �: not found /usr/local/bin/flashershield: 4: /usr
-
Thread
Software zum Steuern des Türschlossantrieb "eqiva eQ-3 Bluetooth Smart Lock"
Ich hab mich dann mit dem AP verbunden: [E][WebServer.cpp:633] _handleRequest(): request handler not found [E][WebServer.cpp:633] _handleRequest(): request handler not found [E][WebServer.cpp:633] _handleRequest(): request handler not found [E][WebServer.cpp:633] _handleRequest(): request handler not found [E][WebServer.cpp:633] _handleRequest(): request handler not found [E][WebServer.cpp:633] _handleRequest(): request handler not found # WIFI: connected to SSiD: XNetz # WIFI: connected! #
-
Thread
char Array für ultoa()
by the unary * operator are a _null pointer_, an address inappropriately aligned for the type of object pointed to, and the address of an object after the end of its lifetime.
object).[/code]
-
Thread
Rust als Embedded-Programmiersprache Gesperrt
src/main.rs:5:8 | 5 | if x = y { | ^^^^^ | | | expected bool, found () | help: try comparing for equality: `x == y` | = note: expected type `bool` found type `()` [/pre] Wer glaubt, dass nur an den Typen von x und y liegt: [pre]
mismatched types --> src/main.rs:4:8 | 4 | if x & 5 { | ^^^^^ expected bool, found integral variable | = note: expected type `bool` found type `{integer}` [/pre] Es compiliert erst, wenn ein bool rauskommt: [pre] fn main() { let x = 5; if x &
-
Thread
FFT auf dem stm32f411RE TrueStudio
libarm_cortexM4lf_math.a" als library hinzuzufügen führt dazu, dass wenn ich auf debug drücke die Meldung: "Program file does not exist D:\Workspace A\FFTandLED\Debug\FFTandLED.elf not found D:\Workspace A\FFTandLED\Debug\FFTandLED.elf not found D:\Workspace A\FFTandLED\Debug\FFTandLED.elf not found" erscheint.
Project->Properties->C/C++ Build->Settings->Tool settings->C Linker->Miscelaneous->Additional object files hinzufügen. Harry
-
Thread
VBA - lahmarschiges Makro beschleunigen, aber wie?
Schleifen definierten Sheet-Objekten zu machen: 'Dateien öffnen Workbooks.Open Filename:=FilePath_Q + FileName_Q2 Workbooks.Open Filename:=FilePath_Q + FileName_Q3 'Sheet-Objekte festlegen (für schnellere Makro-Ausführung) Dim Sheet_Q2 As Excel.Worksheet Dim Sheet_Q3 As
Schleifen definierten Sheet-Objekten zu machen: > > 'Dateien öffnen > Workbooks.Open Filename:=FilePath_Q + FileName_Q2 > Workbooks.Open Filename:=FilePath_Q + FileName_Q3 > > 'Sheet-Objekte festlegen (für schnellere Makro-Ausführung) > Dim Sheet_Q2 As Excel.Worksheet > Dim Sheet_Q3
-
Thread
Keil inline asm
" TO ".\Objects\float" PRINT(".\Listings\float.m51") CODE( 0x4000 ) *** FATAL ERROR L210: I/O ERROR ON INPUT FILE: EXCEPTION 0021H: PATH OR FILE NOT FOUND FILE: .\Objects\float.obj Target not created
SYMBOL: ?C_START MODULE: .\Objects\STARTUP.obj (?C_STARTUP) ADDRESS: 8010H Program Size: data=9.0 xdata=0 code=24 creating hex file from ".\Objects\float"... ".\Objects\float" - 0 Error(s), 3 Warning(s). Build Time Elapsed
-
Artikel
WinAVR
Autoexec.Bat (Windows 98SE) bzw. in der Systemsteuerung (Windows XP, 2000) anzupassen. gcc plug-in: Error: Object file not found on expected location. Diese Fehlermeldung kann nur auftauchen, wenn der GNU C Compiler aus dem AVR-Studio heraus bedient wird. Dass keine weiteren Fehlerursachen genannt werden, ist
dem Programmers Notepad heraus) und auf Fehlermeldungen achten. Siehe auch: gcc plug-in: Error: Object file not found... im Forum avr-gcc: _spawnvp: No such file or directory. > "make.exe" all -------- begin -------- avr-gcc (GCC) 4.1.1 (WinAVR 20070122) Copyright (C) 2006 Free Software Foundation,
-
Thread
arm gcc 7.2.1 -flto broken?
RMszal schrieb im Beitrag #5283733: > What's more weird > is that this issue depends on order of object files in linking. If > startup file is placed first on object list, then LTO works fine. When I > change file order, every IRQ_Handler that is placed before statup file > on a linking list will
not be resolved by adding some compiler flags/attributes to the weak declaration inside startup, but I haven't found any clue so far. I'll try to compare weak declarations inside C compiled objects.
-
Thread
QT auf Beaglebone Black - libGLESv2.so.1 wird nicht gefunden
helloworld ./helloworld: error while loading shared libraries: libGLESv2.so.1: cannot open shared object file: No such file or directory[/c] Folgende DLLs werden vom helloworld benötigt. [c] debian@beaglebone:~$ ldd helloworld linux-vdso.so.1 (0xbec48000) libQt5Widgets.so.5 => /usr/lib/arm-linux-gnueabihf
helloworld > ./helloworld: error while loading shared libraries: libGLESv2.so.1: > cannot open shared object file: No such file or directory[/c] Don't do that, then. ;-) Mal ernsthaft: das Zielsystem ist eine Debian-Installation. Der ganz saubere Weg, ist sich selbst ein Debian-Package zubauen und dieses
-
Thread
xc3sprog compilieren
module 'libftd2xx' -- Package libftd2xx was not found in the pkg-config search path. Perhaps you should add the directory containing `libftd2xx.pc' to the PKG_CONFIG_PATH environment variable Package 'libftd2xx', required by 'world', not found -- Could NOT find LIBFTD2XX (missing: LIBFTD2XX_INCLUDE_DIR) -- Checking for module 'libusb' -- Found libusb, version 0.1.12 -- Found LIBUSB: /usr/lib/x86_64-linux-gnu/libusb.so -- Configuring done --
-
Thread
AVR GPIOR Bit Verwaltung C++
// FIXME: SBI and CBI are available, and the behavior may // FIXME: depend on unrelated code found in the context of usage. if (High == value) PORTB |= PadMask::value; else PORTB &= PadNotMask::value; } template<> INLINE Port_B1::Value Port_B1::get() { return
FIXME: SBI and CBI are available, and the behavior may > // FIXME: depend on unrelated code found in the context of usage. > if (High == value) > PORTB |= PadMask::value; > else > PORTB &= PadNotMask::value; > } > > template<> > INLINE Port_B1::Value Port_B1::get
-
Thread
Cyclone V - Altera SoC - Linux und QT auf einem SoCrates
. Wenn ich allerdings die Files „socfpga_socrates.dtb“ und uImage durch die neu erzeugten Files austausche erhalte ich folgenden Auszug: U-Boot SPL 2013.01.01 (Aug 04 2015 - 21:24:12) BOARD: EBV SoCrates CLOCK: EOSC1 clock 25000
registered as minor 0 [ 1.785306] brd: module loaded [ 1.789374] cadence-qspi ff705000.spi: DMA NOT enabled [ 1.794574] cadence-qspi ff705000.spi: master is unqueued, this is deprecated [ 1.802217] m25p80 spi2.0: n25q256a (32768 Kbytes) [ 1.807245] 6 ofpart partitions found on MTD device
-
Thread
ADALM-Pluto SDR
PS.: Falls Du danach noch Fehler der Art: File "/usr/lib64/python2.7/site-packages/gnuradio/iio/iio_pluto_source_swig.py", line 129, in make return _iio_pluto_source_swig.pluto_source_make(*args, **kwargs) RuntimeError: No Pluto device found
beinhaltet. Das wars! Ich habe mit ldd geschaut und habe den Übeltäter gefunden: ... libqwt5.so.1 => not found ... Nach der Installation von qwt5 funktioniert es jetzt. Vielen Dank für deine Hilfe.
-
Thread
toolchain für STM8 unter Windows
variable : 'ui8_value' main.c:534: warning 85: in function main unreferenced local variable : 'objects_readed' hex2bin -p 00 bin/main.ihx HEX TO BIN FILE CONVERTER V1.1 Copyright Raisonance S.A. 2004 ERROR: Cannot open the input file.make: *** [main] Error 1 X:\work>cd bin X:\work\bin>hex2bin
Hmm, jetzt stehe ich vor dem Problem, das hex-file zu flashen. Wenn ich das ihx-File im ST Visual Programmer öffnen will, kommen jede Menge Fehler, daß der Adressbereich nicht passt. Das stm8flash.exe Tool von https://github.com/tenbaht/sduino-windowstools
-
Thread
Alle Teslas sollen per Software-Update zu vollautonomen Fahrzeugen werden können - realistisch?
Sowie Beitrag 5 und 10 dieses Forums: https://teslamotorsclub.com/tmc/threads/how-does-tesla-treat-a-not-branded-ms-after-accident.67707/
übernehmen. Dann schnell in der Bedienungsanleitung des Autos geblättert, wie man das irgendwo verbaute Not-Lenkrad ausfährt und aktiviert.
-
Thread
Knoppix Biödschirmauflösung ändern
make sure that you have the latest version. [ 13.686] Markers: (--) probed, (**) from config file, (==) default setting, (++) from command line, (!!) notice, (II) informational, (WW) warning, (EE) error, (NI) not implemented, (??) unknown. [ 13.687] (==) Log file: "/var/log/Xorg.0.log"
[ 13.755] (WW) `fonts.dir' not found (or not valid) in "/usr/share/fonts/truetype". [ 13.755] Entry deleted from font path. [ 13.755] (Run 'mkfontdir' on "/usr/share/fonts/truetype"). [ 13.755] (WW) The directory