-
Thread
DLL in Matlab
Function pointer types are unsupported in structures HRESULT ( * QueryInterface )( ILayoutStorage * . Found on line 44385 of input from line 13358 of file C:/ProgramData/MATLAB/SupportPackages/R2017a/MW_MinGW_4_9/x86_64-w64-mingw32/include/objidl.h dann solche hier: Type 'LARGE_INTEGER' was not found. Defaulting to type error. Found on line 59792 of input from line 241 of file C:/ProgramData/MATLAB/SupportPackages/R2017a/MW_MinGW_4_9/x86_64-w64-mingw32/include/winioctl.h und sowas: Failed to parse type '( __cdecl__ ))
-
Artikel
16/32Bit Computer/Konsole
movei r0,3 ;(3+1)*4 = 16 cli ;disable irq udiv16Loop subi r0,1 brts udiv16Loop udivstep ;delay slot note udivstep is not irq save, so use cli/sei lock udivstep ;delay slot udivstep ;delay slot udivstep ;delay slot jmpi r7,0 nop ;delay slot udivgq r2 ;delay slot get qoutient udivgr r3 ;delay slot get remainder
DDDDDDDDDDDDDDDD TIMER_1_LOW (Timer 1 value low) B DDDDDDDDDDDDDDDD TIMER_1_HIGH (Timer 1 value high, note: low/high needs capture first to be updated) C ---------------- D DDDDDDDDDDDDDDDD TIMER_2_LOW (Timer 2 value low) E DDDDDDDDDDDDDDDD TIMER_2_HIGH (Timer 2 value high, note: low/high needs capture first
-
Thread
"System.ComponentModel.Win32Exception" ist in System.dll aufgetreten
= false; p.StartInfo.RedirectStandardOutput = true; p.StartInfo.FileName = "pdftoppm"; p.StartInfo.Arguments = "-mono -f 1 -l 1 -r 600 " + openPdfDialog.FileName + " C:/Windows/Temp/"; p.Start(); // Do not wait for the child process
nachzuschauen, welche Message denn in der Win32Exception steht. Es könnte beispielsweise irgendwas mit "file not found" sein, weil vllt. die "pdftoppm" nicht im Suchpfad der Anwendung vorhanden ist.
-
Thread
Migration c++ Projekt SLES11 nach RHEL7.2
include <vector> ==> #include <bits/stl_algobase.h> ==> #include <bits/c++config.h> //<< not found [/code] Ich vermute einen Fehler in der Installation, weil ich kann mir nicht vorstellen, dass der c++ Compiler nicht konsistent ist. Hat jemand evtl. einen Tipp? Grüsse, René
3.1.02/06_Deployment/binaries' /usr/bin/cmake -E cmake_progress_report /home/user/Proj/binaries/CMakeFiles 1 [ 1%] Building CXX object CMakeFiles/proj.dir/projmain.cpp.o /usr/bin/c++ -D_REENTRANT -Weffc++ -Wall -Wextra -Wno-long-long -fno-strict-aliasing -O2 -I/home/user/Proj/binaries/../../04_Implementation
-
Thread
Eagle 5.10 unter mate 17: libjpeg.so.62 nicht gefunden - woher nehmen?
libjpeg.so.62: [pre] error while loading shared libraries: libjpeg.so.62: cannot open shared object file: No such file or directory [/pre] Ich habe libjpeg62 installiert, aber das ist nur die 64-Bit-Version, während der Eagle offenbar 32 Bit ist. Wo kann man die 32-Bit libjpeg62 her bekommen
nachgesehen, was fehlt. Also z.B. "ldd /opt/eagle/version/bin/eagle", dann steht da bei libjpeg "not found". So kannst du gleich nachsehen, was noch fehlt. //edit3: packages.debian.org - dort das Package suchen - dann die Debian-Version wählen - lib finden. ABER bitte installiere keine zu deiner
-
Thread
Problem mit WampServer und Https
VERSION_APACHE} ServerRoot "${APACHE_DIR}" # # Mutex: Allows you to set the mutex mechanism and mutex file directory # for individual mutexes, or change the global defaults # # Uncomment and change the directory if mutexes are file-based and the default # mutex file directory is not on a local disk or
and .htpasswd files from being # viewed by Web clients. # <Files ".ht*"> Require all denied </Files> # # ErrorLog: The location of the error log file. # If you do not specify an ErrorLog directive within
-
Thread
Horizon EDA [War: Neues, halbfertiges Elektronik-CAD-Programm]
unit.cpp:1: /usr/local/lib/gcc5/gcc/x86_64-portbld-freebsd10.0/5.3.0/include-fixed/stdlib.h:127:3: note: 'strtold' strtold(const char * __restrict, char ** __restrict); ^ In file included from pool/unit.cpp:3:0: ./json.hpp: In member function 'float nlohmann::basic_json<ObjectType, ArrayType
not declared in this scope GtkFileChooserNative *native = gtk_file_chooser_native_new ("Save PDF", ^ imp/imp_schematic.cpp:123:25: error: ‘native’ was not declared in this scope GtkFileChooserNative
-
Thread
Prusa I3 3D Drucker
Filament Width Sensor. Smaller more inexpensive tools are available, just google vernier calipers. 2. Objects found in the Filament - Extruder nozzle continues to jam or not feed properly Advice: If you have a transparent filament, examine some of your prints for foreign objects or possible material found
some white rice to prevent moisture. 4. Extruder continues to clog and bubble over - No foreign objects are found nor is the roundness an issue Advice: PLA filament will typically melt at a higher heat than ABS. It's possible that you have a piece of filament that has hardened inside the nozzle. We
-
Thread
KiCad-Kompilierung
Python-2.7.11/ (Zeile 3) nicht existiert. Angeblich wird eine Datei daraus benutzt, es gibt aber kein "File not found". Jemand ne Idee? [pre] [...] [ 78%] Linking CXX shared module _pcbnew.so /usr/local/lib/libpython2.7.a(posixmodule.o): In function `posix_tmpnam': /Daten/Downloads/Python-2.7.11
2.7.11/ (Zeile 3) nicht existiert. Angeblich > wird eine Datei daraus benutzt, es gibt aber kein "File not found". Möglicherweise benötigst Du noch swig und wxPython aus dem Repository Ich habe mich bei meiner letzten Compilation im Herbst hieran orientiert: http://ci.kicad-pcb.org/job/kicad-doxygen
-
Thread
SSD1306/1309 Library zum Darstellen von Text auf OLED Displays
Laufzeit-Ermittlung: s.o. belastbar und valide ist anders. Tip: die tatsächliche Code-Grösse eines Object-File ermittelt man mit "size" https://linux.die.net/man/1/size
warten willst. Harry L. schrieb im Beitrag #5558280: > Tip: die tatsächliche Code-Grösse eines Object-File ermittelt man mit > "size" Beim avr-gcc Toolchain heist es avr-size. Und was meinst du wie ich die Größe ermittelt hatte? Kannst du in meinem Github nachlesen ;)
-
Thread
STM32F429 WM8789 MP3
MP3_Data_Index; uint16_t AUDIO_Frequency ; uint32_t n_Read; /* File R/W count */ FIL fsra; // file objects UINT ba; /* File read/write count */ /******************************************************************************* * Function
file_fd); //In den Decoder kippen [/c]
-
Thread
for(;;) bedeutung?
Rolf M. schrieb im Beitrag #4758002: > while (result = fread(buf, 1, BUFSIZE, file)) > { > // arbeite mit buf > } > > // Fehlerbehandlung > > ist eine mögliche Anwendung. Ohne die Zuweisung im while müßte man > schreiben > result = fread(buf, 1, BUFSIZE, file); > while
der beiden Sprachfamilien dienen. Ebenso unsinnig ist es, die Objektorientierung von Object-Pascal als Vorteil gegenüber C aufzuführen. Denn für jede Plattform, auf der Object-Pascal läuft, ist auch ein C++-Compiler verfügbar (nur umgekehrt nicht).
-
Thread
.elf datei not found
.eeprom=0 --no-change-warnings ## Objects that must be built in order to link OBJECTS = test.o ## Objects explicitly added by the user LINKONLYOBJECTS = ## Build all: $(TARGET) test.hex test.eep test.lss## Compile test.o: ../test.c
fpack-struct -fshort-enums -MD -MP -MT test2.o -MF dep/test2.o.d -c ../test2.c /usr/bin/sh: -Wall: command not found make: [test2.o] Error 127 (ignored) mmcu=atmega168 -Wl,-Map=test2.map test2.o -o test2.elf /usr/bin/sh: -Wl,-Map=test2.map: command not found make: [test2.elf] Error 127 (ignored) avr-objcopy
-
Thread
Comvisu für Linux
noch: ./ComvisuV051: error while loading shared libraries: libQtWebKit.so.4: cannot open shared object file: No such file or directory libqtWebKit4 habe ich installiert... Hast du eine Idee wo das Problem sein könnte? Danke.
.0 (0x76edb000) libdl.so.2 => /lib/arm-linux-gnueabihf/libdl.so.2 (0x76ec8000) libQt4Pas.so.5 => not found libX11.so.6 => /usr/lib/arm-linux-gnueabihf/libX11.so.6 (0x76db2000) libc.so.6 => /lib/arm-linux-gnueabihf/libc.so.6 (0x76c73000) /lib/ld-linux-armhf.so.3 (0x54ae8000) libxcb.so.1 => /usr/
-
Thread
Sicherheitsvorteil durch Linux?
cc782258%28v=ws.10%29.aspx "When a hotpatch package is installed, it: - Replaces the old binary file on disk with the coldpatch binary file. - Injects the updated function (as a hotpatch binary file) into the loaded image of the defective binary file..." das gab mit Windows Server 2003 und wurde vor
dürfen nicht einfach > vergessen werden, sonst werden wir linux bald nichtmehr wiedererkennen. Zur Not bleiben noch einige BSDs...
-
Thread
FT800 / FT810 Library
appears regarding the SPI library. This is a "feature" of Arduino that for "reasons" the classes are not supposed to work with plain .c files. It should work just fine if you rename "EVE_commands.c" to "EVE_commands.cpp". There might be a solution to fix that without renaming the file but I have not found one yet and I am normally not reminded about this since I am normally not using the Arduino framework. Plus that renaming the file works kind of tells me that the issue is not really on my side.
-
Thread
LPC1768 OpenOCD arm-none-eabi-gcc 5.3.0
flash 'lpc2000' found at 0x00000000 > flash write_image erase /home/pheinrich/workspace/netplug/Test/Debug/Test.elf auto erase enabled wrote 4096 bytes from file /home/pheinrich/workspace/netplug/Test/Debug/Test.elf
modify build tools on developer PC to inject correct LPC vector checksum. wrote 4096 bytes from file /home/pheinrich/workspace/netplug/Test/Debug/lpc_test2.axf in 0.309931s (12.906 KiB/s) > reset run JTAG tap: lpc17xx.cpu tap/device found: 0x4ba00477 (mfg: 0x23b, part: 0xba00, ver: 0x4) [/c]
-
Thread
goto verpönt - was dann nehmen?
Fingern gesogen ein Beispiel um etwas vorzeitig abzubrechen. int complex_io_operation(wchar_t *file, struct *data_block) { if( (Open(file) != 0)) { goto ERROR_1; /* not found? */ } if( AppendData(data_block) != data_block->size ) { goto ERROR_2; /* insufficient data written
if (found) { return 0; // error, all ports are in lists } else { return port; // port is not in lists } [/c]
-
Thread
Belichten von Platinen mit CNC-Fräse + UV-Laser
Der erste Fehler: "No tools found". [code] $ python gbr2laser.py What do you want to calculate: 1: Perimeter + filling 2: Only filling 3: Only perimeter (default 1) Gerber-File as input(default GerberTest.gbr) ngc-File
Y/N (default N) Filling bidirectional Y/N (default N) Import tools GerberTest.gbr No tools found! IllegalArgumentException: Operation not supported by GeometryCollection Traceback (most recent call last): File "gbr2laser.py", line 1286, in <module> geometry = cascaded_union(geometry
-
Thread
COLLECT2.EXE: ERROR: LD RETURNED 1 EXIT STATUS
Heisst error 2 nicht "file not found"?
qv4jsonobject.obj .obj/qv4mathobject.obj .obj/qv4memberdata.o bj .obj/qv4numberobject.obj .obj/qv4object.obj .obj/qv4objectproto.obj .obj/qv4r egexpobject.obj .obj/qv4stringobject.obj .obj/qv4variantobject.obj .obj/qv4objec titerator.obj .obj/qv4regexp.obj .obj/qv4serialize.obj .obj/qv4script.obj .obj
-
Thread
[simulavr] Build-Problem
gcc... gcc checking whether the C compiler works... yes checking for C compiler default output file name... a.out checking for suffix of executables... checking whether we are cross compiling... no checking for suffix of object files... o checking whether we are using the GNU C compiler... yes
:70:23: note: declarations in dependent base ‘std::vector<std::pair<long long int, SimulationMember*>, std::allocator<std::pair<long long int, SimulationMember*> > >’ are not found by unqualified lookup systemclock.cpp
-
Thread
WordClock mit WS2812
File "serial\serialutil.pyo", line 282, in __init__ File "serial\serialwin32.pyo", line 66, in open SerialException: could not open port 'COM7': WindowsError(5, 'Zugriff verweigert') [/code]
Nucleo powered laptop (still not done as it is described on the website) is not cut. ESP powered by a separate power supply does not work (weight combined with Nucleo)
-
Thread
#include in Makefile Fehler
obj/blinky.lst Was von sh mit folgender Meldung quittiert wird: > /usr/bin/sh: C:4.9: command not found Korrigiere die Pfadtrenner und wenn Du Leerzeichen in den Pfaden vermeidest, ersparst Du Dir auch eine Menge Ärger.
$(CORE_PARENT) vpath %.cpp $(CORE_PARENT) # automatically create lists of the sources and objects LC_FILES := $(patsubst $(LIBRARY_PARENT)/%, %, $(wildcard $(LIBRARY_PATH)/*/*.c)) LCPP_FILES := $(patsubst $(LIBRARY_PARENT)/%, %, $(wildcard $(LIBRARY_PATH)/*/*.cpp)) TC_FILES := $(patsubst $(
-
Thread
BusyBox, Programm installieren
BusyBox damit nichts anfangen: [code]> cd /usr/bin > ls | grep m4 m4 > ./m4 -/bin/ash: ./m4: not found [/code] Da BusyBox wohl eine einzelne Executable ist, frage ich mich, ob das so überhaupt gehen kann? Kann ich irgendwo was reinschreiben, so das BusyBox 'm4' findet? Oder muss ich BusyBox
Was sagen $ file /usr/bin/m4 $ LD_TRACE_LOADED_OBJECTS=1 /usr/bin/m4 Matthias